{"text_format":"1","workbook":"xlsx","n_sheets":5,"sheets":["Instructions","Roster","Duty Roster","Calculator","Tables"],"not_rendered":{"charts":0,"images":1,"macros":1,"external_links":0,"defined_names":23,"comments":0,"pivot_tables":0},"unopened":[],"bounds":{"document_bytes":16777216,"sheet_cells":100000,"rows_first":2000,"rows_last":500,"rows_between":2000,"halvings":0,"cell_chars":16384,"cell_head_chars":4096},"cells_cut":0,"cells_raw":0,"read":"whole","date_system":"1900"}

{"sheet":"Instructions","index":0,"n_rows":13,"n_cols":3,"rows_kept":13,"cut":false,"hidden":false,"merged":[[12,0,12,2],[8,0,8,2],[2,0,2,2],[0,0,0,2],[11,0,11,2],[1,0,1,2]]}
["Philmont Trek Duty Roster Instructions"]
["9-Day Treks"]
["This spreadsheet was developed to produce duty rosters for a Philmont Trek.  Any number of participants may be included in the Duty Roster (up to the crew maximum size of 12).  The spreadsheet has a number of \"tabs\" for different worksheets.  These are used as follows:"]
[1,"Instructions","This worksheet, instructions on using the spreadsheet."]
[2,"Roster","    This is the worksheet where information is entered.  Move between cells by using the TAB key.  Information is entered in the cells that are shaded light green.\n    Enter the names of the crewmembers that will have duty roster duties (last name first, separated with a comma).  After the names have been entered, enter the crew member number in the grid for job assignments (i.e., 1, 2, ...4, etc.).  Up to two crew members may be assigned to a job on any given day.\n    As you enter crew member numbers in the grid, the total number of job assignments they have will show in gray to the right of their name and the \ntable below the entry area will show a running total of assignments by person & job.\n    The campsites are based on the Philmont 2024 Itinerary Guidebook and are updated when you enter your itinerary number."]
[3,"Duty Roster","This worksheet is the printable duty roster.  It is formatted for 8-1/2 x 11 paper in landscape mode.  It is suggested that a copy be printed and laminated (possibly reduced in size) for each member of the crew."]
[4,"Calculator","This is an internal worksheet that has no user information.  It is used for the internal calculations.\n "]
[5,"Tables","This is an internal (hidden) worksheet that has no user information.  It contains the list of camps and food pickups for itineraries as well as the entire camp list."]
["The cells in the worksheets are \"locked\" so that you may only enter information in the \"unlocked\" cells.  To make changes to the spreadsheet or access \"locked\" cells, use the Tools/Protection/Unprotect sheet... menu command.  There are no passwords."]
[]
["If you have suggestions or recommendations for changes to this spreadsheet, please send "]
["them to Sid Covington by clicking on the Philmont arrowhead:"]
[{"$f":"getlastsavedate()","v":"1/2/2024 11:11PM"}]

{"sheet":"Roster","index":1,"n_rows":30,"n_cols":17,"rows_kept":30,"cut":false,"hidden":false,"merged":[[17,8,17,9],[18,8,18,9],[21,8,21,9],[27,8,27,9],[28,8,28,9],[22,8,22,9],[23,8,23,9],[24,8,24,9],[25,8,25,9],[26,8,26,9],[15,13,16,13],[15,8,16,9],[15,11,16,11],[15,7,16,7],[15,3,15,4],[16,3,16,4],[15,12,16,12],[22,1,25,1],[0,16,14,16],[15,14,16,14],[18,3,18,4],[19,3,19,4],[20,3,20,4],[14,3,14,4],[19,8,19,9],[20,8,20,9],[21,3,21,4],[15,10,16,10],[17,3,17,4],[15,16,16,16],[16,6,29,6],[29,7,29,9],[15,15,16,15]]}
["#","Name","LastName","FirstName","Jobs",null,"Trek Day #","Day","Date","Campsite","Water","Stoves Fuel","Meal Cleanup","Site Setup","Bear Bags","Cook Dinner","Assign daily jobs to crewmembers by entering crewmember # \nin the job column for the day of the trek."]
[{"$f":"IF(ISBLANK(B2),\"\",1)","v":1},"Farkel, Fred",{"$f":"IF(ISBLANK(B2),\"\",LEFT(B2,SEARCH(\",\",B2)-1))","v":"Farkel"},{"$f":"IF(ISBLANK(B2),\"\",RIGHT(B2,LEN(B2)-SEARCH(\",\",B2)-1))","v":"Fred"},{"$f":"Calculator!I4","v":7},null,2,{"$f":"INDEX(week_days,WEEKDAY(I2,1),2)","v":"Fri"},{"$f":"Arrival+G2-1","v":"2024-06-21"},{"$f":"IF(VLOOKUP(INDEX(Campsite,G2-1),campInfo,2)=\"S\",UPPER(INDEX(Campsite,G2-1)),INDEX(Campsite,G2-1))","v":"HARLAN"},1,2,3,4,5,6]
[{"$f":"IF(ISBLANK(B3),\"\",A2+1)","v":2},"Jones, Davey",{"$f":"IF(ISBLANK(B3),\"\",LEFT(B3,SEARCH(\",\",B3)-1))","v":"Jones"},{"$f":"IF(ISBLANK(B3),\"\",RIGHT(B3,LEN(B3)-SEARCH(\",\",B3)-1))","v":"Davey"},{"$f":"Calculator!I5","v":7},null,null,null,null,null,7,8,9,10,11,12]
[{"$f":"IF(ISBLANK(B4),\"\",A3+1)","v":3},"Brown, Sam","Brown","Sam",{"$f":"Calculator!I6","v":7},null,3,{"$f":"INDEX(week_days,WEEKDAY(I4,1),2)","v":"Sat"},{"$f":"Arrival+G4-1","v":"2024-06-22"},{"$f":"IF(VLOOKUP(INDEX(Campsite,G4-1),campInfo,2)=\"S\",UPPER(INDEX(Campsite,G4-1)),INDEX(Campsite,G4-1))","v":"Devil's Wash Basin"},2,3,4,5,6,7]
[4,"Washington, George","Washington","George",{"$f":"Calculator!I7","v":7},null,null,null,null,null,8,9,10,11,12,1]
[5,"Kiddlehopper, Clem","Kiddlehopper","Clem",{"$f":"Calculator!I8","v":7},null,4,"Sun",{"$f":"Arrival+G6-1","v":"2024-06-23"},{"$f":"IF(VLOOKUP(INDEX(Campsite,G6-1),campInfo,2)=\"S\",UPPER(INDEX(Campsite,G6-1)),INDEX(Campsite,G6-1))","v":"CIMARRONCITA"},3,4,5,6,7,8]
[6,"Bush, George W.","Bush","George W.",{"$f":"Calculator!I9","v":7},null,null,null,null,null,9,10,11,12,1,2]
[7,"Lincoln, Abe","Lincoln","Abe",{"$f":"Calculator!I10","v":7},null,5,"Mon",{"$f":"Arrival+G8-1","v":"2024-06-24"},{"$f":"IF(VLOOKUP(INDEX(Campsite,G8-1),campInfo,2)=\"S\",UPPER(INDEX(Campsite,G8-1)),INDEX(Campsite,G8-1))","v":"Black Jacks"},4,5,6,7,8,9]
[8,"Eisenhower, Ike","Eisenhower","Ike",{"$f":"Calculator!I11","v":7},null,null,null,null,null,10,11,12,1,2,3]
[9,"Adams, John","Adams","John",{"$f":"Calculator!I12","v":7},null,6,"Tue",{"$f":"Arrival+G10-1","v":"2024-06-25"},{"$f":"IF(VLOOKUP(INDEX(Campsite,G10-1),campInfo,2)=\"S\",UPPER(INDEX(Campsite,G10-1)),INDEX(Campsite,G10-1))","v":"Elkhorn"},5,6,7,8,9,10]
[10,"Cody, Bill","Cody","Bill",{"$f":"Calculator!I13","v":7},null,null,null,null,null,11,12,1,2,3,4]
[11,"Phillips, Waite","Phillips","Waite",{"$f":"Calculator!I14","v":7},null,7,"Wed",{"$f":"Arrival+G12-1","v":"2024-06-26"},{"$f":"IF(VLOOKUP(INDEX(Campsite,G12-1),campInfo,2)=\"S\",UPPER(INDEX(Campsite,G12-1)),INDEX(Campsite,G12-1))","v":"PONIL"},6,7,8,9,10,11]
[12,"Custer, George","Custer","George",{"$f":"Calculator!I15","v":7},null,null,null,null,null,12,1,2,3,4,5]
[null,null,null,null,null,null,8,{"$f":"INDEX(week_days,WEEKDAY(I14,1),2)","v":"Thu"},{"$f":"Arrival+G14-1","v":"2024-06-27"},{"$f":"IF(VLOOKUP(INDEX(Campsite,G14-1),campInfo,2)=\"S\",UPPER(INDEX(Campsite,G14-1)),INDEX(Campsite,G14-1))","v":"INDIAN WRITINGS"},7,8,9,10,11,12]
[null,"Expedition #","Day #","Campsite for night",null,null,null,null,null,null,1,2,3,4,5,6]
[null,"620-9B",2,{"$f":"INDEX(campsites,numericItinerary($B$22),C16-1)","v":"Harlan"},null,null,null,"#","Name",null,{"$f":"K1","v":"Water"},"Stoves Fuel","Meal Cleanup","Site Setup","Bear Bags","Cook Dinner","Total"]
[null,"Unit #",3,{"$f":"INDEX(campsites,numericItinerary($B$22),C17-1)","v":"Devil's Wash Basin"},null,null,"Number of Times Job Assigned"]
[null,"Troop 123",4,{"$f":"INDEX(campsites,numericItinerary($B$22),C18-1)","v":"Cimarroncita"},null,null,null,{"$f":"A2","v":1},{"$f":"B2","v":"Farkel, Fred"},null,{"$f":"COUNTIF(K$2:K$15,$H18)","v":2},1,1,1,1,1,{"$f":"SUM(K18:P18)","v":7}]
[null,"Trek Arrival Day",5,{"$f":"INDEX(campsites,numericItinerary($B$22),C19-1)","v":"Black Jacks"},null,null,null,2,"Jones, Davey",null,1,2,1,1,1,1,{"$f":"SUM(K19:P19)","v":7}]
[null,{"$f":"LEFT(Expedition,1)&\"/\"&MID(Expedition,2,2)&\"/\"&getSpreadsheetProperty(\"trekYear\")","v":"6/20/2024"},6,{"$f":"INDEX(campsites,numericItinerary($B$22),C20-1)","v":"Elkhorn"},null,null,null,3,"Brown, Sam",null,1,1,2,1,1,1,7]
[null,"Itinerary #",7,{"$f":"INDEX(campsites,numericItinerary($B$22),C21-1)","v":"Ponil"},null,null,null,4,"Washington, George",null,1,1,1,2,1,1,7]
[null,"9-1",8,{"$f":"INDEX(campsites,numericItinerary($B$22),C22-1)","v":"Indian Writings"},null,null,null,5,"Kiddlehopper, Clem",null,1,1,1,1,2,1,7]
[null,{"$f":"IF(editItinerary(itineraryNumber),\"\",\"Itinerary number must be in the form of  \"\"\"  & getSpreadsheetProperty(\"nDays\") &  \"-\"\"\" & \"  followed by a number between 1 and \" & getSpreadsheetProperty(\"nItineraries\"))","v":""},null,null,null,null,null,6,"Bush, George W.",null,1,1,1,1,1,2,7]
[null,null,null,null,null,null,null,7,"Lincoln, Abe",null,2,1,1,1,1,1,7]
[null,null,null,null,null,null,null,8,"Eisenhower, Ike",null,1,2,1,1,1,1,7]
[null,null,null,null,null,null,null,9,"Adams, John",null,1,1,2,1,1,1,7]
[null,null,null,null,null,null,null,10,"Cody, Bill",null,1,1,1,2,1,1,7]
[null,null,null,null,null,null,null,11,"Phillips, Waite",null,1,1,1,1,2,1,7]
[null,null,null,null,null,null,null,12,"Custer, George",null,1,1,1,1,1,2,7]
[null,null,null,null,null,null,null,"Total Assignments:",null,null,{"$f":"SUM(K18:K29)","v":14},{"$f":"SUM(L18:L29)","v":14},14,14,14,14,84]

{"sheet":"Duty Roster","index":2,"n_rows":17,"n_cols":14,"rows_kept":17,"cut":false,"hidden":false,"merged":[[15,6,16,6],[15,7,16,7],[15,2,16,2],[15,4,16,4],[11,7,12,7],[13,7,14,7],[13,6,14,6],[11,4,12,4],[13,4,14,4],[13,5,14,5],[9,0,10,0],[11,0,12,0],[15,0,16,0],[15,1,16,1],[9,5,10,5],[15,5,16,5],[13,1,14,1],[11,1,12,1],[9,1,10,1],[7,1,8,1],[7,6,8,6],[9,6,10,6],[9,4,10,4],[7,5,8,5],[7,0,8,0],[5,4,6,4],[13,0,14,0],[1,13,2,13],[3,0,4,0],[3,1,4,1],[3,2,4,2],[3,7,4,7],[11,2,12,2],[13,2,14,2],[7,2,8,2],[7,7,8,7],[9,7,10,7],[9,2,10,2],[7,4,8,4],[5,5,6,5],[5,7,6,7],[0,3,0,12],[0,0,0,2],[3,4,4,4],[3,5,4,5],[3,6,4,6],[5,0,6,0],[5,6,6,6],[5,2,6,2],[5,1,6,1]]}
[{"$f":"\"Expedition # \" & Expedition","v":"Expedition # 620-9B"},null,null,"Philmont Trek Duty Roster",null,null,null,null,null,null,null,null,null,{"$f":"Unit","v":"Troop 123"}]
[{"$f":"\"Itinerary # \" & itineraryNumber","v":"Itinerary # 9-1"},null,null,null,null,null,null,null,null,null,null,null,null,"Cook Dinner"]
["Trek Day #","Day","Date","Campsite\n     Food Pickup","Sh","Com","T.P.","Dry","Water","Stoves/Fuel","Meal Cleanup","Site Setup","Bear Bags"]
[2,{"$f":"Roster!H2","v":"Fri"},{"$f":"Roster!I2","v":"2024-06-21"},{"$f":"Roster!J2","v":"HARLAN"},{"$f":"UPPER(VLOOKUP($D4,campInfo,3))","v":""},{"$f":"UPPER(VLOOKUP($D4,campInfo,4))","v":""},{"$f":"UPPER(VLOOKUP($D4,campInfo,5))","v":""},{"$f":"UPPER(VLOOKUP($D4,campInfo,7))","v":""},{"$f":"IF(INDEX(assignments,ROW($I4)-ROW(I$3),COLUMN(I4)-COLUMN($H4))<1,\"\",INDEX(FirstNames,INDEX(assignments,ROW($I4)-ROW(I$3),COLUMN(I4)-COLUMN($H4)),1))","v":"Fred"},"Davey","Sam","George","Clem","George W."]
[null,null,null,{"$f":"IF(ISBLANK(Tables!B19),\"\",Tables!B19)","v":"Camping HQ"},null,null,null,null,{"$f":"IF(INDEX(assignments,ROW($I5)-ROW(I$3),COLUMN(I5)-COLUMN($H5))<1,\"\",INDEX(FirstNames,INDEX(assignments,ROW($I5)-ROW(I$3),COLUMN(I5)-COLUMN($H5)),1))","v":"Abe"},"Ike","John","Bill","Waite","George"]
[3,{"$f":"Roster!H4","v":"Sat"},{"$f":"Roster!I4","v":"2024-06-22"},{"$f":"Roster!J4","v":"Devil's Wash Basin"},{"$f":"UPPER(VLOOKUP($D6,campInfo,3))","v":""},{"$f":"UPPER(VLOOKUP($D6,campInfo,4))","v":""},{"$f":"UPPER(VLOOKUP($D6,campInfo,5))","v":""},{"$f":"UPPER(VLOOKUP($D6,campInfo,7))","v":"Y"},"Davey","Sam","George","Clem","George W.","Abe"]
[null,null,null,{"$f":"IF(ISBLANK(Tables!C19),\"\",Tables!C19)","v":""},null,null,null,null,"Ike","John","Bill","Waite","George","Fred"]
[4,{"$f":"Roster!H6","v":"Sun"},{"$f":"Roster!I6","v":"2024-06-23"},{"$f":"Roster!J6","v":"CIMARRONCITA"},{"$f":"UPPER(VLOOKUP($D8,campInfo,3))","v":""},{"$f":"UPPER(VLOOKUP($D8,campInfo,4))","v":""},{"$f":"UPPER(VLOOKUP($D8,campInfo,5))","v":""},{"$f":"UPPER(VLOOKUP($D8,campInfo,7))","v":""},"Sam","George","Clem","George W.","Abe","Ike"]
[null,null,null,{"$f":"IF(ISBLANK(Tables!D19),\"\",Tables!D19)","v":"Cimarroncita"},null,null,null,null,"John","Bill","Waite","George","Fred","Davey"]
[5,{"$f":"Roster!H8","v":"Mon"},{"$f":"Roster!I8","v":"2024-06-24"},{"$f":"Roster!J8","v":"Black Jacks"},{"$f":"UPPER(VLOOKUP($D10,campInfo,3))","v":""},{"$f":"UPPER(VLOOKUP($D10,campInfo,4))","v":""},{"$f":"UPPER(VLOOKUP($D10,campInfo,5))","v":""},{"$f":"UPPER(VLOOKUP($D10,campInfo,7))","v":""},"George","Clem","George W.","Abe","Ike","John"]
[null,null,null,{"$f":"IF(ISBLANK(Tables!E19),\"\",Tables!E19)","v":""},null,null,null,null,"Bill","Waite","George","Fred","Davey","Sam"]
[6,{"$f":"Roster!H10","v":"Tue"},{"$f":"Roster!I10","v":"2024-06-25"},{"$f":"Roster!J10","v":"Elkhorn"},{"$f":"UPPER(VLOOKUP($D12,campInfo,3))","v":""},{"$f":"UPPER(VLOOKUP($D12,campInfo,4))","v":""},{"$f":"UPPER(VLOOKUP($D12,campInfo,5))","v":""},{"$f":"UPPER(VLOOKUP($D12,campInfo,7))","v":""},"Clem","George W.","Abe","Ike","John","Bill"]
[null,null,null,{"$f":"IF(ISBLANK(Tables!F19),\"\",Tables!F19)","v":""},null,null,null,null,"Waite","George","Fred","Davey","Sam","George"]
[7,{"$f":"Roster!H12","v":"Wed"},{"$f":"Roster!I12","v":"2024-06-26"},{"$f":"Roster!J12","v":"PONIL"},{"$f":"UPPER(VLOOKUP($D14,campInfo,3))","v":"Y"},{"$f":"UPPER(VLOOKUP($D14,campInfo,4))","v":"Y"},{"$f":"UPPER(VLOOKUP($D14,campInfo,5))","v":"Y"},{"$f":"UPPER(VLOOKUP($D14,campInfo,7))","v":""},"George W.","Abe","Ike","John","Bill","Waite"]
[null,null,null,{"$f":"IF(ISBLANK(Tables!G19),\"\",Tables!G19)","v":"Ponil"},null,null,null,null,"George","Fred","Davey","Sam","George","Clem"]
[11,{"$f":"Roster!H14","v":"Thu"},{"$f":"Roster!I14","v":"2024-06-27"},{"$f":"Roster!J14","v":"INDIAN WRITINGS"},{"$f":"UPPER(VLOOKUP($D16,campInfo,3))","v":"Y"},{"$f":"UPPER(VLOOKUP($D16,campInfo,4))","v":""},{"$f":"UPPER(VLOOKUP($D16,campInfo,5))","v":""},{"$f":"UPPER(VLOOKUP($D16,campInfo,7))","v":""},"Abe","Ike","John","Bill","Waite","George"]
[null,null,null,{"$f":"IF(ISBLANK(Tables!H24),\"\",Tables!H24)","v":"Cimarroncita"},null,null,null,null,"Fred","Davey","Sam","George","Clem","George W."]

{"sheet":"Calculator","index":3,"n_rows":18,"n_cols":84,"rows_kept":18,"cut":false,"hidden":true,"merged":[[18,6,18,7],[1,8,2,8],[1,0,1,5],[17,6,17,7]]}
[null,null,null,null,null,null,null,null,null,{"$f":"A3","v":"Water"},null,null,null,null,null,null,null,null,null,null,null,{"$f":"B3","v":"Stoves Fuel"},null,null,null,null,null,null,null,null,null,null,null,{"$f":"C3","v":"Meal Cleanup"},null,null,null,null,null,null,null,null,null,null,null,{"$f":"D3","v":"Site Setup"},null,null,null,null,null,null,null,null,null,null,null,{"$f":"E3","v":"Bear Bags"},null,null,null,null,null,null,null,null,null,null,null,{"$f":"F3","v":"Cook Dinner"}]
["Participant's assigned to jobs by day (from Roster):",null,null,null,null,null,"Assignments:",null,"Total Jobs",{"$f":"$G$4","v":1},{"$f":"$G$5","v":2},{"$f":"$G$6","v":3},{"$f":"$G$7","v":4},{"$f":"$G$8","v":5},{"$f":"$G$9","v":6},{"$f":"$G$10","v":7},{"$f":"$G$11","v":8},{"$f":"$G$12","v":9},{"$f":"$G$13","v":10},{"$f":"$G$14","v":11},{"$f":"$G$15","v":12},{"$f":"$G$4","v":1},{"$f":"$G$5","v":2},{"$f":"$G$6","v":3},{"$f":"$G$7","v":4},{"$f":"$G$8","v":5},{"$f":"$G$9","v":6},{"$f":"$G$10","v":7},{"$f":"$G$11","v":8},{"$f":"$G$12","v":9},{"$f":"$G$13","v":10},{"$f":"$G$14","v":11},{"$f":"$G$15","v":12},{"$f":"$G$4","v":1},{"$f":"$G$5","v":2},{"$f":"$G$6","v":3},{"$f":"$G$7","v":4},{"$f":"$G$8","v":5},{"$f":"$G$9","v":6},{"$f":"$G$10","v":7},{"$f":"$G$11","v":8},{"$f":"$G$12","v":9},{"$f":"$G$13","v":10},{"$f":"$G$14","v":11},{"$f":"$G$15","v":12},{"$f":"$G$4","v":1},{"$f":"$G$5","v":2},{"$f":"$G$6","v":3},{"$f":"$G$7","v":4},{"$f":"$G$8","v":5},{"$f":"$G$9","v":6},{"$f":"$G$10","v":7},{"$f":"$G$11","v":8},{"$f":"$G$12","v":9},{"$f":"$G$13","v":10},{"$f":"$G$14","v":11},{"$f":"$G$15","v":12},{"$f":"$G$4","v":1},{"$f":"$G$5","v":2},{"$f":"$G$6","v":3},{"$f":"$G$7","v":4},{"$f":"$G$8","v":5},{"$f":"$G$9","v":6},{"$f":"$G$10","v":7},{"$f":"$G$11","v":8},{"$f":"$G$12","v":9},{"$f":"$G$13","v":10},{"$f":"$G$14","v":11},{"$f":"$G$15","v":12},{"$f":"$G$4","v":1},{"$f":"$G$5","v":2},{"$f":"$G$6","v":3},{"$f":"$G$7","v":4},{"$f":"$G$8","v":5},{"$f":"$G$9","v":6},{"$f":"$G$10","v":7},{"$f":"$G$11","v":8},{"$f":"$G$12","v":9},{"$f":"$G$13","v":10},{"$f":"$G$14","v":11},{"$f":"$G$15","v":12}]
[{"$f":"Roster!K1","v":"Water"},{"$f":"Roster!L1","v":"Stoves Fuel"},{"$f":"Roster!M1","v":"Meal Cleanup"},{"$f":"Roster!N1","v":"Site Setup"},{"$f":"Roster!O1","v":"Bear Bags"},{"$f":"Roster!P1","v":"Cook Dinner"},"Person #","Name",null,{"$f":"$H$4","v":"Fred"},{"$f":"$H$5","v":"Davey"},{"$f":"$H$6","v":"Sam"},{"$f":"$H$7","v":"George"},{"$f":"$H$8","v":"Clem"},{"$f":"$H$9","v":"George W."},{"$f":"$H$10","v":"Abe"},{"$f":"$H$11","v":"Ike"},{"$f":"$H$12","v":"John"},{"$f":"$H$13","v":"Bill"},{"$f":"$H$14","v":"Waite"},{"$f":"$H$15","v":"George"},{"$f":"$H$4","v":"Fred"},{"$f":"$H$5","v":"Davey"},{"$f":"$H$6","v":"Sam"},{"$f":"$H$7","v":"George"},{"$f":"$H$8","v":"Clem"},{"$f":"$H$9","v":"George W."},{"$f":"$H$10","v":"Abe"},{"$f":"$H$11","v":"Ike"},{"$f":"$H$12","v":"John"},{"$f":"$H$13","v":"Bill"},{"$f":"$H$14","v":"Waite"},{"$f":"$H$15","v":"George"},{"$f":"$H$4","v":"Fred"},{"$f":"$H$5","v":"Davey"},{"$f":"$H$6","v":"Sam"},{"$f":"$H$7","v":"George"},{"$f":"$H$8","v":"Clem"},{"$f":"$H$9","v":"George W."},{"$f":"$H$10","v":"Abe"},{"$f":"$H$11","v":"Ike"},{"$f":"$H$12","v":"John"},{"$f":"$H$13","v":"Bill"},{"$f":"$H$14","v":"Waite"},{"$f":"$H$15","v":"George"},{"$f":"$H$4","v":"Fred"},{"$f":"$H$5","v":"Davey"},{"$f":"$H$6","v":"Sam"},{"$f":"$H$7","v":"George"},{"$f":"$H$8","v":"Clem"},{"$f":"$H$9","v":"George W."},{"$f":"$H$10","v":"Abe"},{"$f":"$H$11","v":"Ike"},{"$f":"$H$12","v":"John"},{"$f":"$H$13","v":"Bill"},{"$f":"$H$14","v":"Waite"},{"$f":"$H$15","v":"George"},{"$f":"$H$4","v":"Fred"},{"$f":"$H$5","v":"Davey"},{"$f":"$H$6","v":"Sam"},{"$f":"$H$7","v":"George"},{"$f":"$H$8","v":"Clem"},{"$f":"$H$9","v":"George W."},{"$f":"$H$10","v":"Abe"},{"$f":"$H$11","v":"Ike"},{"$f":"$H$12","v":"John"},{"$f":"$H$13","v":"Bill"},{"$f":"$H$14","v":"Waite"},{"$f":"$H$15","v":"George"},{"$f":"$H$4","v":"Fred"},{"$f":"$H$5","v":"Davey"},{"$f":"$H$6","v":"Sam"},{"$f":"$H$7","v":"George"},{"$f":"$H$8","v":"Clem"},{"$f":"$H$9","v":"George W."},{"$f":"$H$10","v":"Abe"},{"$f":"$H$11","v":"Ike"},{"$f":"$H$12","v":"John"},{"$f":"$H$13","v":"Bill"},{"$f":"$H$14","v":"Waite"},{"$f":"$H$15","v":"George"},null,"Week Days"]
[{"$f":"Roster!K2","v":1},{"$f":"Roster!L2","v":2},{"$f":"Roster!M2","v":3},{"$f":"Roster!N2","v":4},{"$f":"Roster!O2","v":5},{"$f":"Roster!P2","v":6},{"$f":"Roster!A2","v":1},{"$f":"IF(ISBLANK(Roster!D2),\"\",Roster!D2)","v":"Fred"},{"$f":"IF(H4=\"\",\"\",INDEX(Water,18,$G4)+INDEX(Stoves_Fuel,18,$G4)+INDEX(Meal_Cleanup,18,$G4)+INDEX(Site_Setup,18,$G4)+INDEX(Bear_Bags,18,$G4)+INDEX(Cook_Dinner,18,$G4))","v":7},{"$f":"IF(Roster!$K$2=J$2,1,0)","v":1},{"$f":"IF(Roster!$K$2=K$2,1,0)","v":0},{"$f":"IF(Roster!$K$2=L$2,1,0)","v":0},{"$f":"IF(Roster!$K$2=M$2,1,0)","v":0},{"$f":"IF(Roster!$K$2=N$2,1,0)","v":0},{"$f":"IF(Roster!$K$2=O$2,1,0)","v":0},{"$f":"IF(Roster!$K$2=P$2,1,0)","v":0},{"$f":"IF(Roster!$K$2=Q$2,1,0)","v":0},{"$f":"IF(Roster!$K$2=R$2,1,0)","v":0},{"$f":"IF(Roster!$K$2=S$2,1,0)","v":0},{"$f":"IF(Roster!$K$2=T$2,1,0)","v":0},{"$f":"IF(Roster!$K$2=U$2,1,0)","v":0},{"$f":"IF(Roster!$L$2=V$2,1,0)","v":0},{"$f":"IF(Roster!$L$2=W$2,1,0)","v":1},{"$f":"IF(Roster!$L$2=X$2,1,0)","v":0},{"$f":"IF(Roster!$L$2=Y$2,1,0)","v":0},{"$f":"IF(Roster!$L$2=Z$2,1,0)","v":0},{"$f":"IF(Roster!$L$2=AA$2,1,0)","v":0},{"$f":"IF(Roster!$L$2=AB$2,1,0)","v":0},{"$f":"IF(Roster!$L$2=AC$2,1,0)","v":0},{"$f":"IF(Roster!$L$2=AD$2,1,0)","v":0},{"$f":"IF(Roster!$L$2=AE$2,1,0)","v":0},{"$f":"IF(Roster!$L$2=AF$2,1,0)","v":0},{"$f":"IF(Roster!$L$2=AG$2,1,0)","v":0},{"$f":"IF(Roster!$M$2=AH$2,1,0)","v":0},{"$f":"IF(Roster!$M$2=AI$2,1,0)","v":0},{"$f":"IF(Roster!$M$2=AJ$2,1,0)","v":1},{"$f":"IF(Roster!$M$2=AK$2,1,0)","v":0},{"$f":"IF(Roster!$M$2=AL$2,1,0)","v":0},{"$f":"IF(Roster!$M$2=AM$2,1,0)","v":0},{"$f":"IF(Roster!$M$2=AN$2,1,0)","v":0},{"$f":"IF(Roster!$M$2=AO$2,1,0)","v":0},{"$f":"IF(Roster!$M$2=AP$2,1,0)","v":0},{"$f":"IF(Roster!$M$2=AQ$2,1,0)","v":0},{"$f":"IF(Roster!$M$2=AR$2,1,0)","v":0},{"$f":"IF(Roster!$M$2=AS$2,1,0)","v":0},{"$f":"IF(Roster!$N$2=AT$2,1,0)","v":0},{"$f":"IF(Roster!$N$2=AU$2,1,0)","v":0},{"$f":"IF(Roster!$N$2=AV$2,1,0)","v":0},{"$f":"IF(Roster!$N$2=AW$2,1,0)","v":1},{"$f":"IF(Roster!$N$2=AX$2,1,0)","v":0},{"$f":"IF(Roster!$N$2=AY$2,1,0)","v":0},{"$f":"IF(Roster!$N$2=AZ$2,1,0)","v":0},{"$f":"IF(Roster!$N$2=BA$2,1,0)","v":0},{"$f":"IF(Roster!$N$2=BB$2,1,0)","v":0},{"$f":"IF(Roster!$N$2=BC$2,1,0)","v":0},{"$f":"IF(Roster!$N$2=BD$2,1,0)","v":0},{"$f":"IF(Roster!$N$2=BE$2,1,0)","v":0},{"$f":"IF(Roster!$O$2=BF$2,1,0)","v":0},{"$f":"IF(Roster!$O$2=BG$2,1,0)","v":0},{"$f":"IF(Roster!$O$2=BH$2,1,0)","v":0},{"$f":"IF(Roster!$O$2=BI$2,1,0)","v":0},{"$f":"IF(Roster!$O$2=BJ$2,1,0)","v":1},{"$f":"IF(Roster!$O$2=BK$2,1,0)","v":0},{"$f":"IF(Roster!$O$2=BL$2,1,0)","v":0},{"$f":"IF(Roster!$O$2=BM$2,1,0)","v":0},{"$f":"IF(Roster!$O$2=BN$2,1,0)","v":0},{"$f":"IF(Roster!$O$2=BO$2,1,0)","v":0},{"$f":"IF(Roster!$O$2=BP$2,1,0)","v":0},{"$f":"IF(Roster!$O$2=BQ$2,1,0)","v":0},{"$f":"IF(Roster!$P$2=BR$2,1,0)","v":0},{"$f":"IF(Roster!$P$2=BS$2,1,0)","v":0},{"$f":"IF(Roster!$P$2=BT$2,1,0)","v":0},{"$f":"IF(Roster!$P$2=BU$2,1,0)","v":0},{"$f":"IF(Roster!$P$2=BV$2,1,0)","v":0},{"$f":"IF(Roster!$P$2=BW$2,1,0)","v":1},{"$f":"IF(Roster!$P$2=BX$2,1,0)","v":0},{"$f":"IF(Roster!$P$2=BY$2,1,0)","v":0},{"$f":"IF(Roster!$P$2=BZ$2,1,0)","v":0},{"$f":"IF(Roster!$P$2=CA$2,1,0)","v":0},{"$f":"IF(Roster!$P$2=CB$2,1,0)","v":0},{"$f":"IF(Roster!$P$2=CC$2,1,0)","v":0},null,"Sunday","Sun"]
[{"$f":"Roster!K3","v":7},{"$f":"Roster!L3","v":8},{"$f":"Roster!M3","v":9},{"$f":"Roster!N3","v":10},{"$f":"Roster!O3","v":11},{"$f":"Roster!P3","v":12},{"$f":"Roster!A3","v":2},{"$f":"IF(ISBLANK(Roster!D3),\"\",Roster!D3)","v":"Davey"},{"$f":"IF(H5=\"\",\"\",INDEX(Water,18,$G5)+INDEX(Stoves_Fuel,18,$G5)+INDEX(Meal_Cleanup,18,$G5)+INDEX(Site_Setup,18,$G5)+INDEX(Bear_Bags,18,$G5)+INDEX(Cook_Dinner,18,$G5))","v":7},{"$f":"IF(Roster!$K$3=J$2,1,0)","v":0},{"$f":"IF(Roster!$K$3=K$2,1,0)","v":0},{"$f":"IF(Roster!$K$3=L$2,1,0)","v":0},{"$f":"IF(Roster!$K$3=M$2,1,0)","v":0},{"$f":"IF(Roster!$K$3=N$2,1,0)","v":0},{"$f":"IF(Roster!$K$3=O$2,1,0)","v":0},{"$f":"IF(Roster!$K$3=P$2,1,0)","v":1},{"$f":"IF(Roster!$K$3=Q$2,1,0)","v":0},{"$f":"IF(Roster!$K$3=R$2,1,0)","v":0},{"$f":"IF(Roster!$K$3=S$2,1,0)","v":0},{"$f":"IF(Roster!$K$3=T$2,1,0)","v":0},{"$f":"IF(Roster!$K$3=U$2,1,0)","v":0},{"$f":"IF(Roster!$L$3=V$2,1,0)","v":0},{"$f":"IF(Roster!$L$3=W$2,1,0)","v":0},{"$f":"IF(Roster!$L$3=X$2,1,0)","v":0},{"$f":"IF(Roster!$L$3=Y$2,1,0)","v":0},{"$f":"IF(Roster!$L$3=Z$2,1,0)","v":0},{"$f":"IF(Roster!$L$3=AA$2,1,0)","v":0},{"$f":"IF(Roster!$L$3=AB$2,1,0)","v":0},{"$f":"IF(Roster!$L$3=AC$2,1,0)","v":1},{"$f":"IF(Roster!$L$3=AD$2,1,0)","v":0},{"$f":"IF(Roster!$L$3=AE$2,1,0)","v":0},{"$f":"IF(Roster!$L$3=AF$2,1,0)","v":0},{"$f":"IF(Roster!$L$3=AG$2,1,0)","v":0},{"$f":"IF(Roster!$M$3=AH$2,1,0)","v":0},{"$f":"IF(Roster!$M$3=AI$2,1,0)","v":0},{"$f":"IF(Roster!$M$3=AJ$2,1,0)","v":0},{"$f":"IF(Roster!$M$3=AK$2,1,0)","v":0},{"$f":"IF(Roster!$M$3=AL$2,1,0)","v":0},{"$f":"IF(Roster!$M$3=AM$2,1,0)","v":0},{"$f":"IF(Roster!$M$3=AN$2,1,0)","v":0},{"$f":"IF(Roster!$M$3=AO$2,1,0)","v":0},{"$f":"IF(Roster!$M$3=AP$2,1,0)","v":1},{"$f":"IF(Roster!$M$3=AQ$2,1,0)","v":0},{"$f":"IF(Roster!$M$3=AR$2,1,0)","v":0},{"$f":"IF(Roster!$M$3=AS$2,1,0)","v":0},{"$f":"IF(Roster!$N$3=AT$2,1,0)","v":0},{"$f":"IF(Roster!$N$3=AU$2,1,0)","v":0},{"$f":"IF(Roster!$N$3=AV$2,1,0)","v":0},{"$f":"IF(Roster!$N$3=AW$2,1,0)","v":0},{"$f":"IF(Roster!$N$3=AX$2,1,0)","v":0},{"$f":"IF(Roster!$N$3=AY$2,1,0)","v":0},{"$f":"IF(Roster!$N$3=AZ$2,1,0)","v":0},{"$f":"IF(Roster!$N$3=BA$2,1,0)","v":0},{"$f":"IF(Roster!$N$3=BB$2,1,0)","v":0},{"$f":"IF(Roster!$N$3=BC$2,1,0)","v":1},{"$f":"IF(Roster!$N$3=BD$2,1,0)","v":0},{"$f":"IF(Roster!$N$3=BE$2,1,0)","v":0},{"$f":"IF(Roster!$O$3=BF$2,1,0)","v":0},{"$f":"IF(Roster!$O$3=BG$2,1,0)","v":0},{"$f":"IF(Roster!$O$3=BH$2,1,0)","v":0},{"$f":"IF(Roster!$O$3=BI$2,1,0)","v":0},{"$f":"IF(Roster!$O$3=BJ$2,1,0)","v":0},{"$f":"IF(Roster!$O$3=BK$2,1,0)","v":0},{"$f":"IF(Roster!$O$3=BL$2,1,0)","v":0},{"$f":"IF(Roster!$O$3=BM$2,1,0)","v":0},{"$f":"IF(Roster!$O$3=BN$2,1,0)","v":0},{"$f":"IF(Roster!$O$3=BO$2,1,0)","v":0},{"$f":"IF(Roster!$O$3=BP$2,1,0)","v":1},{"$f":"IF(Roster!$O$3=BQ$2,1,0)","v":0},{"$f":"IF(Roster!$P$3=BR$2,1,0)","v":0},{"$f":"IF(Roster!$P$3=BS$2,1,0)","v":0},{"$f":"IF(Roster!$P$3=BT$2,1,0)","v":0},{"$f":"IF(Roster!$P$3=BU$2,1,0)","v":0},{"$f":"IF(Roster!$P$3=BV$2,1,0)","v":0},{"$f":"IF(Roster!$P$3=BW$2,1,0)","v":0},{"$f":"IF(Roster!$P$3=BX$2,1,0)","v":0},{"$f":"IF(Roster!$P$3=BY$2,1,0)","v":0},{"$f":"IF(Roster!$P$3=BZ$2,1,0)","v":0},{"$f":"IF(Roster!$P$3=CA$2,1,0)","v":0},{"$f":"IF(Roster!$P$3=CB$2,1,0)","v":0},{"$f":"IF(Roster!$P$3=CC$2,1,0)","v":1},null,"Monday","Mon"]
[{"$f":"Roster!K4","v":2},{"$f":"Roster!L4","v":3},{"$f":"Roster!M4","v":4},{"$f":"Roster!N4","v":5},{"$f":"Roster!O4","v":6},{"$f":"Roster!P4","v":7},{"$f":"Roster!A4","v":3},{"$f":"IF(ISBLANK(Roster!D4),\"\",Roster!D4)","v":"Sam"},{"$f":"IF(H6=\"\",\"\",INDEX(Water,18,$G6)+INDEX(Stoves_Fuel,18,$G6)+INDEX(Meal_Cleanup,18,$G6)+INDEX(Site_Setup,18,$G6)+INDEX(Bear_Bags,18,$G6)+INDEX(Cook_Dinner,18,$G6))","v":7},{"$f":"IF(Roster!$K$4=J$2,1,0)","v":0},{"$f":"IF(Roster!$K$4=K$2,1,0)","v":1},{"$f":"IF(Roster!$K$4=L$2,1,0)","v":0},{"$f":"IF(Roster!$K$4=M$2,1,0)","v":0},{"$f":"IF(Roster!$K$4=N$2,1,0)","v":0},{"$f":"IF(Roster!$K$4=O$2,1,0)","v":0},{"$f":"IF(Roster!$K$4=P$2,1,0)","v":0},{"$f":"IF(Roster!$K$4=Q$2,1,0)","v":0},{"$f":"IF(Roster!$K$4=R$2,1,0)","v":0},{"$f":"IF(Roster!$K$4=S$2,1,0)","v":0},{"$f":"IF(Roster!$K$4=T$2,1,0)","v":0},{"$f":"IF(Roster!$K$4=U$2,1,0)","v":0},{"$f":"IF(Roster!$L$4=V$2,1,0)","v":0},{"$f":"IF(Roster!$L$4=W$2,1,0)","v":0},{"$f":"IF(Roster!$L$4=X$2,1,0)","v":1},{"$f":"IF(Roster!$L$4=Y$2,1,0)","v":0},{"$f":"IF(Roster!$L$4=Z$2,1,0)","v":0},{"$f":"IF(Roster!$L$4=AA$2,1,0)","v":0},{"$f":"IF(Roster!$L$4=AB$2,1,0)","v":0},{"$f":"IF(Roster!$L$4=AC$2,1,0)","v":0},{"$f":"IF(Roster!$L$4=AD$2,1,0)","v":0},{"$f":"IF(Roster!$L$4=AE$2,1,0)","v":0},{"$f":"IF(Roster!$L$4=AF$2,1,0)","v":0},{"$f":"IF(Roster!$L$4=AG$2,1,0)","v":0},{"$f":"IF(Roster!$M$4=AH$2,1,0)","v":0},{"$f":"IF(Roster!$M$4=AI$2,1,0)","v":0},{"$f":"IF(Roster!$M$4=AJ$2,1,0)","v":0},{"$f":"IF(Roster!$M$4=AK$2,1,0)","v":1},{"$f":"IF(Roster!$M$4=AL$2,1,0)","v":0},{"$f":"IF(Roster!$M$4=AM$2,1,0)","v":0},{"$f":"IF(Roster!$M$4=AN$2,1,0)","v":0},{"$f":"IF(Roster!$M$4=AO$2,1,0)","v":0},{"$f":"IF(Roster!$M$4=AP$2,1,0)","v":0},{"$f":"IF(Roster!$M$4=AQ$2,1,0)","v":0},{"$f":"IF(Roster!$M$4=AR$2,1,0)","v":0},{"$f":"IF(Roster!$M$4=AS$2,1,0)","v":0},{"$f":"IF(Roster!$N$4=AT$2,1,0)","v":0},{"$f":"IF(Roster!$N$4=AU$2,1,0)","v":0},{"$f":"IF(Roster!$N$4=AV$2,1,0)","v":0},{"$f":"IF(Roster!$N$4=AW$2,1,0)","v":0},{"$f":"IF(Roster!$N$4=AX$2,1,0)","v":1},{"$f":"IF(Roster!$N$4=AY$2,1,0)","v":0},{"$f":"IF(Roster!$N$4=AZ$2,1,0)","v":0},{"$f":"IF(Roster!$N$4=BA$2,1,0)","v":0},{"$f":"IF(Roster!$N$4=BB$2,1,0)","v":0},{"$f":"IF(Roster!$N$4=BC$2,1,0)","v":0},{"$f":"IF(Roster!$N$4=BD$2,1,0)","v":0},{"$f":"IF(Roster!$N$4=BE$2,1,0)","v":0},{"$f":"IF(Roster!$O$4=BF$2,1,0)","v":0},{"$f":"IF(Roster!$O$4=BG$2,1,0)","v":0},{"$f":"IF(Roster!$O$4=BH$2,1,0)","v":0},{"$f":"IF(Roster!$O$4=BI$2,1,0)","v":0},{"$f":"IF(Roster!$O$4=BJ$2,1,0)","v":0},{"$f":"IF(Roster!$O$4=BK$2,1,0)","v":1},{"$f":"IF(Roster!$O$4=BL$2,1,0)","v":0},{"$f":"IF(Roster!$O$4=BM$2,1,0)","v":0},{"$f":"IF(Roster!$O$4=BN$2,1,0)","v":0},{"$f":"IF(Roster!$O$4=BO$2,1,0)","v":0},{"$f":"IF(Roster!$O$4=BP$2,1,0)","v":0},{"$f":"IF(Roster!$O$4=BQ$2,1,0)","v":0},{"$f":"IF(Roster!$P$4=BR$2,1,0)","v":0},{"$f":"IF(Roster!$P$4=BS$2,1,0)","v":0},{"$f":"IF(Roster!$P$4=BT$2,1,0)","v":0},{"$f":"IF(Roster!$P$4=BU$2,1,0)","v":0},{"$f":"IF(Roster!$P$4=BV$2,1,0)","v":0},{"$f":"IF(Roster!$P$4=BW$2,1,0)","v":0},{"$f":"IF(Roster!$P$4=BX$2,1,0)","v":1},{"$f":"IF(Roster!$P$4=BY$2,1,0)","v":0},{"$f":"IF(Roster!$P$4=BZ$2,1,0)","v":0},{"$f":"IF(Roster!$P$4=CA$2,1,0)","v":0},{"$f":"IF(Roster!$P$4=CB$2,1,0)","v":0},{"$f":"IF(Roster!$P$4=CC$2,1,0)","v":0},null,"Tuesday","Tue"]
[{"$f":"Roster!K5","v":8},{"$f":"Roster!L5","v":9},{"$f":"Roster!M5","v":10},{"$f":"Roster!N5","v":11},{"$f":"Roster!O5","v":12},{"$f":"Roster!P5","v":1},{"$f":"Roster!A5","v":4},{"$f":"IF(ISBLANK(Roster!D5),\"\",Roster!D5)","v":"George"},{"$f":"IF(H7=\"\",\"\",INDEX(Water,18,$G7)+INDEX(Stoves_Fuel,18,$G7)+INDEX(Meal_Cleanup,18,$G7)+INDEX(Site_Setup,18,$G7)+INDEX(Bear_Bags,18,$G7)+INDEX(Cook_Dinner,18,$G7))","v":7},{"$f":"IF(Roster!$K$5=J$2,1,0)","v":0},{"$f":"IF(Roster!$K$5=K$2,1,0)","v":0},{"$f":"IF(Roster!$K$5=L$2,1,0)","v":0},{"$f":"IF(Roster!$K$5=M$2,1,0)","v":0},{"$f":"IF(Roster!$K$5=N$2,1,0)","v":0},{"$f":"IF(Roster!$K$5=O$2,1,0)","v":0},{"$f":"IF(Roster!$K$5=P$2,1,0)","v":0},{"$f":"IF(Roster!$K$5=Q$2,1,0)","v":1},{"$f":"IF(Roster!$K$5=R$2,1,0)","v":0},{"$f":"IF(Roster!$K$5=S$2,1,0)","v":0},{"$f":"IF(Roster!$K$5=T$2,1,0)","v":0},{"$f":"IF(Roster!$K$5=U$2,1,0)","v":0},{"$f":"IF(Roster!$L$5=V$2,1,0)","v":0},{"$f":"IF(Roster!$L$5=W$2,1,0)","v":0},{"$f":"IF(Roster!$L$5=X$2,1,0)","v":0},{"$f":"IF(Roster!$L$5=Y$2,1,0)","v":0},{"$f":"IF(Roster!$L$5=Z$2,1,0)","v":0},{"$f":"IF(Roster!$L$5=AA$2,1,0)","v":0},{"$f":"IF(Roster!$L$5=AB$2,1,0)","v":0},{"$f":"IF(Roster!$L$5=AC$2,1,0)","v":0},{"$f":"IF(Roster!$L$5=AD$2,1,0)","v":1},{"$f":"IF(Roster!$L$5=AE$2,1,0)","v":0},{"$f":"IF(Roster!$L$5=AF$2,1,0)","v":0},{"$f":"IF(Roster!$L$5=AG$2,1,0)","v":0},{"$f":"IF(Roster!$M$5=AH$2,1,0)","v":0},{"$f":"IF(Roster!$M$5=AI$2,1,0)","v":0},{"$f":"IF(Roster!$M$5=AJ$2,1,0)","v":0},{"$f":"IF(Roster!$M$5=AK$2,1,0)","v":0},{"$f":"IF(Roster!$M$5=AL$2,1,0)","v":0},{"$f":"IF(Roster!$M$5=AM$2,1,0)","v":0},{"$f":"IF(Roster!$M$5=AN$2,1,0)","v":0},{"$f":"IF(Roster!$M$5=AO$2,1,0)","v":0},{"$f":"IF(Roster!$M$5=AP$2,1,0)","v":0},{"$f":"IF(Roster!$M$5=AQ$2,1,0)","v":1},{"$f":"IF(Roster!$M$5=AR$2,1,0)","v":0},{"$f":"IF(Roster!$M$5=AS$2,1,0)","v":0},{"$f":"IF(Roster!$N$5=AT$2,1,0)","v":0},{"$f":"IF(Roster!$N$5=AU$2,1,0)","v":0},{"$f":"IF(Roster!$N$5=AV$2,1,0)","v":0},{"$f":"IF(Roster!$N$5=AW$2,1,0)","v":0},{"$f":"IF(Roster!$N$5=AX$2,1,0)","v":0},{"$f":"IF(Roster!$N$5=AY$2,1,0)","v":0},{"$f":"IF(Roster!$N$5=AZ$2,1,0)","v":0},{"$f":"IF(Roster!$N$5=BA$2,1,0)","v":0},{"$f":"IF(Roster!$N$5=BB$2,1,0)","v":0},{"$f":"IF(Roster!$N$5=BC$2,1,0)","v":0},{"$f":"IF(Roster!$N$5=BD$2,1,0)","v":1},{"$f":"IF(Roster!$N$5=BE$2,1,0)","v":0},{"$f":"IF(Roster!$O$5=BF$2,1,0)","v":0},{"$f":"IF(Roster!$O$5=BG$2,1,0)","v":0},{"$f":"IF(Roster!$O$5=BH$2,1,0)","v":0},{"$f":"IF(Roster!$O$5=BI$2,1,0)","v":0},{"$f":"IF(Roster!$O$5=BJ$2,1,0)","v":0},{"$f":"IF(Roster!$O$5=BK$2,1,0)","v":0},{"$f":"IF(Roster!$O$5=BL$2,1,0)","v":0},{"$f":"IF(Roster!$O$5=BM$2,1,0)","v":0},{"$f":"IF(Roster!$O$5=BN$2,1,0)","v":0},{"$f":"IF(Roster!$O$5=BO$2,1,0)","v":0},{"$f":"IF(Roster!$O$5=BP$2,1,0)","v":0},{"$f":"IF(Roster!$O$5=BQ$2,1,0)","v":1},{"$f":"IF(Roster!$P$5=BR$2,1,0)","v":1},{"$f":"IF(Roster!$P$5=BS$2,1,0)","v":0},{"$f":"IF(Roster!$P$5=BT$2,1,0)","v":0},{"$f":"IF(Roster!$P$5=BU$2,1,0)","v":0},{"$f":"IF(Roster!$P$5=BV$2,1,0)","v":0},{"$f":"IF(Roster!$P$5=BW$2,1,0)","v":0},{"$f":"IF(Roster!$P$5=BX$2,1,0)","v":0},{"$f":"IF(Roster!$P$5=BY$2,1,0)","v":0},{"$f":"IF(Roster!$P$5=BZ$2,1,0)","v":0},{"$f":"IF(Roster!$P$5=CA$2,1,0)","v":0},{"$f":"IF(Roster!$P$5=CB$2,1,0)","v":0},{"$f":"IF(Roster!$P$5=CC$2,1,0)","v":0},null,"Wednesday","Wed"]
[{"$f":"Roster!K6","v":3},{"$f":"Roster!L6","v":4},{"$f":"Roster!M6","v":5},{"$f":"Roster!N6","v":6},{"$f":"Roster!O6","v":7},{"$f":"Roster!P6","v":8},{"$f":"Roster!A6","v":5},{"$f":"IF(ISBLANK(Roster!D6),\"\",Roster!D6)","v":"Clem"},{"$f":"IF(H8=\"\",\"\",INDEX(Water,18,$G8)+INDEX(Stoves_Fuel,18,$G8)+INDEX(Meal_Cleanup,18,$G8)+INDEX(Site_Setup,18,$G8)+INDEX(Bear_Bags,18,$G8)+INDEX(Cook_Dinner,18,$G8))","v":7},{"$f":"IF(Roster!$K$6=J$2,1,0)","v":0},{"$f":"IF(Roster!$K$6=K$2,1,0)","v":0},{"$f":"IF(Roster!$K$6=L$2,1,0)","v":1},{"$f":"IF(Roster!$K$6=M$2,1,0)","v":0},{"$f":"IF(Roster!$K$6=N$2,1,0)","v":0},{"$f":"IF(Roster!$K$6=O$2,1,0)","v":0},{"$f":"IF(Roster!$K$6=P$2,1,0)","v":0},{"$f":"IF(Roster!$K$6=Q$2,1,0)","v":0},{"$f":"IF(Roster!$K$6=R$2,1,0)","v":0},{"$f":"IF(Roster!$K$6=S$2,1,0)","v":0},{"$f":"IF(Roster!$K$6=T$2,1,0)","v":0},{"$f":"IF(Roster!$K$6=U$2,1,0)","v":0},{"$f":"IF(Roster!$L$6=V$2,1,0)","v":0},{"$f":"IF(Roster!$L$6=W$2,1,0)","v":0},{"$f":"IF(Roster!$L$6=X$2,1,0)","v":0},{"$f":"IF(Roster!$L$6=Y$2,1,0)","v":1},{"$f":"IF(Roster!$L$6=Z$2,1,0)","v":0},{"$f":"IF(Roster!$L$6=AA$2,1,0)","v":0},{"$f":"IF(Roster!$L$6=AB$2,1,0)","v":0},{"$f":"IF(Roster!$L$6=AC$2,1,0)","v":0},{"$f":"IF(Roster!$L$6=AD$2,1,0)","v":0},{"$f":"IF(Roster!$L$6=AE$2,1,0)","v":0},{"$f":"IF(Roster!$L$6=AF$2,1,0)","v":0},{"$f":"IF(Roster!$L$6=AG$2,1,0)","v":0},{"$f":"IF(Roster!$M$6=AH$2,1,0)","v":0},{"$f":"IF(Roster!$M$6=AI$2,1,0)","v":0},{"$f":"IF(Roster!$M$6=AJ$2,1,0)","v":0},{"$f":"IF(Roster!$M$6=AK$2,1,0)","v":0},{"$f":"IF(Roster!$M$6=AL$2,1,0)","v":1},{"$f":"IF(Roster!$M$6=AM$2,1,0)","v":0},{"$f":"IF(Roster!$M$6=AN$2,1,0)","v":0},{"$f":"IF(Roster!$M$6=AO$2,1,0)","v":0},{"$f":"IF(Roster!$M$6=AP$2,1,0)","v":0},{"$f":"IF(Roster!$M$6=AQ$2,1,0)","v":0},{"$f":"IF(Roster!$M$6=AR$2,1,0)","v":0},{"$f":"IF(Roster!$M$6=AS$2,1,0)","v":0},{"$f":"IF(Roster!$N$6=AT$2,1,0)","v":0},{"$f":"IF(Roster!$N$6=AU$2,1,0)","v":0},{"$f":"IF(Roster!$N$6=AV$2,1,0)","v":0},{"$f":"IF(Roster!$N$6=AW$2,1,0)","v":0},{"$f":"IF(Roster!$N$6=AX$2,1,0)","v":0},{"$f":"IF(Roster!$N$6=AY$2,1,0)","v":1},{"$f":"IF(Roster!$N$6=AZ$2,1,0)","v":0},{"$f":"IF(Roster!$N$6=BA$2,1,0)","v":0},{"$f":"IF(Roster!$N$6=BB$2,1,0)","v":0},{"$f":"IF(Roster!$N$6=BC$2,1,0)","v":0},{"$f":"IF(Roster!$N$6=BD$2,1,0)","v":0},{"$f":"IF(Roster!$N$6=BE$2,1,0)","v":0},{"$f":"IF(Roster!$O$6=BF$2,1,0)","v":0},{"$f":"IF(Roster!$O$6=BG$2,1,0)","v":0},{"$f":"IF(Roster!$O$6=BH$2,1,0)","v":0},{"$f":"IF(Roster!$O$6=BI$2,1,0)","v":0},{"$f":"IF(Roster!$O$6=BJ$2,1,0)","v":0},{"$f":"IF(Roster!$O$6=BK$2,1,0)","v":0},{"$f":"IF(Roster!$O$6=BL$2,1,0)","v":1},{"$f":"IF(Roster!$O$6=BM$2,1,0)","v":0},{"$f":"IF(Roster!$O$6=BN$2,1,0)","v":0},{"$f":"IF(Roster!$O$6=BO$2,1,0)","v":0},{"$f":"IF(Roster!$O$6=BP$2,1,0)","v":0},{"$f":"IF(Roster!$O$6=BQ$2,1,0)","v":0},{"$f":"IF(Roster!$P$6=BR$2,1,0)","v":0},{"$f":"IF(Roster!$P$6=BS$2,1,0)","v":0},{"$f":"IF(Roster!$P$6=BT$2,1,0)","v":0},{"$f":"IF(Roster!$P$6=BU$2,1,0)","v":0},{"$f":"IF(Roster!$P$6=BV$2,1,0)","v":0},{"$f":"IF(Roster!$P$6=BW$2,1,0)","v":0},{"$f":"IF(Roster!$P$6=BX$2,1,0)","v":0},{"$f":"IF(Roster!$P$6=BY$2,1,0)","v":1},{"$f":"IF(Roster!$P$6=BZ$2,1,0)","v":0},{"$f":"IF(Roster!$P$6=CA$2,1,0)","v":0},{"$f":"IF(Roster!$P$6=CB$2,1,0)","v":0},{"$f":"IF(Roster!$P$6=CC$2,1,0)","v":0},null,"Thursday","Thu"]
[{"$f":"Roster!K7","v":9},{"$f":"Roster!L7","v":10},{"$f":"Roster!M7","v":11},{"$f":"Roster!N7","v":12},{"$f":"Roster!O7","v":1},{"$f":"Roster!P7","v":2},{"$f":"Roster!A7","v":6},{"$f":"IF(ISBLANK(Roster!D7),\"\",Roster!D7)","v":"George W."},{"$f":"IF(H9=\"\",\"\",INDEX(Water,18,$G9)+INDEX(Stoves_Fuel,18,$G9)+INDEX(Meal_Cleanup,18,$G9)+INDEX(Site_Setup,18,$G9)+INDEX(Bear_Bags,18,$G9)+INDEX(Cook_Dinner,18,$G9))","v":7},{"$f":"IF(Roster!$K$7=J$2,1,0)","v":0},{"$f":"IF(Roster!$K$7=K$2,1,0)","v":0},{"$f":"IF(Roster!$K$7=L$2,1,0)","v":0},{"$f":"IF(Roster!$K$7=M$2,1,0)","v":0},{"$f":"IF(Roster!$K$7=N$2,1,0)","v":0},{"$f":"IF(Roster!$K$7=O$2,1,0)","v":0},{"$f":"IF(Roster!$K$7=P$2,1,0)","v":0},{"$f":"IF(Roster!$K$7=Q$2,1,0)","v":0},{"$f":"IF(Roster!$K$7=R$2,1,0)","v":1},{"$f":"IF(Roster!$K$7=S$2,1,0)","v":0},{"$f":"IF(Roster!$K$7=T$2,1,0)","v":0},{"$f":"IF(Roster!$K$7=U$2,1,0)","v":0},{"$f":"IF(Roster!$L$7=V$2,1,0)","v":0},{"$f":"IF(Roster!$L$7=W$2,1,0)","v":0},{"$f":"IF(Roster!$L$7=X$2,1,0)","v":0},{"$f":"IF(Roster!$L$7=Y$2,1,0)","v":0},{"$f":"IF(Roster!$L$7=Z$2,1,0)","v":0},{"$f":"IF(Roster!$L$7=AA$2,1,0)","v":0},{"$f":"IF(Roster!$L$7=AB$2,1,0)","v":0},{"$f":"IF(Roster!$L$7=AC$2,1,0)","v":0},{"$f":"IF(Roster!$L$7=AD$2,1,0)","v":0},{"$f":"IF(Roster!$L$7=AE$2,1,0)","v":1},{"$f":"IF(Roster!$L$7=AF$2,1,0)","v":0},{"$f":"IF(Roster!$L$7=AG$2,1,0)","v":0},{"$f":"IF(Roster!$M$7=AH$2,1,0)","v":0},{"$f":"IF(Roster!$M$7=AI$2,1,0)","v":0},{"$f":"IF(Roster!$M$7=AJ$2,1,0)","v":0},{"$f":"IF(Roster!$M$7=AK$2,1,0)","v":0},{"$f":"IF(Roster!$M$7=AL$2,1,0)","v":0},{"$f":"IF(Roster!$M$7=AM$2,1,0)","v":0},{"$f":"IF(Roster!$M$7=AN$2,1,0)","v":0},{"$f":"IF(Roster!$M$7=AO$2,1,0)","v":0},{"$f":"IF(Roster!$M$7=AP$2,1,0)","v":0},{"$f":"IF(Roster!$M$7=AQ$2,1,0)","v":0},{"$f":"IF(Roster!$M$7=AR$2,1,0)","v":1},{"$f":"IF(Roster!$M$7=AS$2,1,0)","v":0},{"$f":"IF(Roster!$N$7=AT$2,1,0)","v":0},{"$f":"IF(Roster!$N$7=AU$2,1,0)","v":0},{"$f":"IF(Roster!$N$7=AV$2,1,0)","v":0},{"$f":"IF(Roster!$N$7=AW$2,1,0)","v":0},{"$f":"IF(Roster!$N$7=AX$2,1,0)","v":0},{"$f":"IF(Roster!$N$7=AY$2,1,0)","v":0},{"$f":"IF(Roster!$N$7=AZ$2,1,0)","v":0},{"$f":"IF(Roster!$N$7=BA$2,1,0)","v":0},{"$f":"IF(Roster!$N$7=BB$2,1,0)","v":0},{"$f":"IF(Roster!$N$7=BC$2,1,0)","v":0},{"$f":"IF(Roster!$N$7=BD$2,1,0)","v":0},{"$f":"IF(Roster!$N$7=BE$2,1,0)","v":1},{"$f":"IF(Roster!$O$7=BF$2,1,0)","v":1},{"$f":"IF(Roster!$O$7=BG$2,1,0)","v":0},{"$f":"IF(Roster!$O$7=BH$2,1,0)","v":0},{"$f":"IF(Roster!$O$7=BI$2,1,0)","v":0},{"$f":"IF(Roster!$O$7=BJ$2,1,0)","v":0},{"$f":"IF(Roster!$O$7=BK$2,1,0)","v":0},{"$f":"IF(Roster!$O$7=BL$2,1,0)","v":0},{"$f":"IF(Roster!$O$7=BM$2,1,0)","v":0},{"$f":"IF(Roster!$O$7=BN$2,1,0)","v":0},{"$f":"IF(Roster!$O$7=BO$2,1,0)","v":0},{"$f":"IF(Roster!$O$7=BP$2,1,0)","v":0},{"$f":"IF(Roster!$O$7=BQ$2,1,0)","v":0},{"$f":"IF(Roster!$P$7=BR$2,1,0)","v":0},{"$f":"IF(Roster!$P$7=BS$2,1,0)","v":1},{"$f":"IF(Roster!$P$7=BT$2,1,0)","v":0},{"$f":"IF(Roster!$P$7=BU$2,1,0)","v":0},{"$f":"IF(Roster!$P$7=BV$2,1,0)","v":0},{"$f":"IF(Roster!$P$7=BW$2,1,0)","v":0},{"$f":"IF(Roster!$P$7=BX$2,1,0)","v":0},{"$f":"IF(Roster!$P$7=BY$2,1,0)","v":0},{"$f":"IF(Roster!$P$7=BZ$2,1,0)","v":0},{"$f":"IF(Roster!$P$7=CA$2,1,0)","v":0},{"$f":"IF(Roster!$P$7=CB$2,1,0)","v":0},{"$f":"IF(Roster!$P$7=CC$2,1,0)","v":0},null,"Friday","Fri"]
[{"$f":"Roster!K8","v":4},{"$f":"Roster!L8","v":5},{"$f":"Roster!M8","v":6},{"$f":"Roster!N8","v":7},{"$f":"Roster!O8","v":8},{"$f":"Roster!P8","v":9},{"$f":"Roster!A8","v":7},{"$f":"IF(ISBLANK(Roster!D8),\"\",Roster!D8)","v":"Abe"},{"$f":"IF(H10=\"\",\"\",INDEX(Water,18,$G10)+INDEX(Stoves_Fuel,18,$G10)+INDEX(Meal_Cleanup,18,$G10)+INDEX(Site_Setup,18,$G10)+INDEX(Bear_Bags,18,$G10)+INDEX(Cook_Dinner,18,$G10))","v":7},{"$f":"IF(Roster!$K$8=J$2,1,0)","v":0},{"$f":"IF(Roster!$K$8=K$2,1,0)","v":0},{"$f":"IF(Roster!$K$8=L$2,1,0)","v":0},{"$f":"IF(Roster!$K$8=M$2,1,0)","v":1},{"$f":"IF(Roster!$K$8=N$2,1,0)","v":0},{"$f":"IF(Roster!$K$8=O$2,1,0)","v":0},{"$f":"IF(Roster!$K$8=P$2,1,0)","v":0},{"$f":"IF(Roster!$K$8=Q$2,1,0)","v":0},{"$f":"IF(Roster!$K$8=R$2,1,0)","v":0},{"$f":"IF(Roster!$K$8=S$2,1,0)","v":0},{"$f":"IF(Roster!$K$8=T$2,1,0)","v":0},{"$f":"IF(Roster!$K$8=U$2,1,0)","v":0},{"$f":"IF(Roster!$L$8=V$2,1,0)","v":0},{"$f":"IF(Roster!$L$8=W$2,1,0)","v":0},{"$f":"IF(Roster!$L$8=X$2,1,0)","v":0},{"$f":"IF(Roster!$L$8=Y$2,1,0)","v":0},{"$f":"IF(Roster!$L$8=Z$2,1,0)","v":1},{"$f":"IF(Roster!$L$8=AA$2,1,0)","v":0},{"$f":"IF(Roster!$L$8=AB$2,1,0)","v":0},{"$f":"IF(Roster!$L$8=AC$2,1,0)","v":0},{"$f":"IF(Roster!$L$8=AD$2,1,0)","v":0},{"$f":"IF(Roster!$L$8=AE$2,1,0)","v":0},{"$f":"IF(Roster!$L$8=AF$2,1,0)","v":0},{"$f":"IF(Roster!$L$8=AG$2,1,0)","v":0},{"$f":"IF(Roster!$M$8=AH$2,1,0)","v":0},{"$f":"IF(Roster!$M$8=AI$2,1,0)","v":0},{"$f":"IF(Roster!$M$8=AJ$2,1,0)","v":0},{"$f":"IF(Roster!$M$8=AK$2,1,0)","v":0},{"$f":"IF(Roster!$M$8=AL$2,1,0)","v":0},{"$f":"IF(Roster!$M$8=AM$2,1,0)","v":1},{"$f":"IF(Roster!$M$8=AN$2,1,0)","v":0},{"$f":"IF(Roster!$M$8=AO$2,1,0)","v":0},{"$f":"IF(Roster!$M$8=AP$2,1,0)","v":0},{"$f":"IF(Roster!$M$8=AQ$2,1,0)","v":0},{"$f":"IF(Roster!$M$8=AR$2,1,0)","v":0},{"$f":"IF(Roster!$M$8=AS$2,1,0)","v":0},{"$f":"IF(Roster!$N$8=AT$2,1,0)","v":0},{"$f":"IF(Roster!$N$8=AU$2,1,0)","v":0},{"$f":"IF(Roster!$N$8=AV$2,1,0)","v":0},{"$f":"IF(Roster!$N$8=AW$2,1,0)","v":0},{"$f":"IF(Roster!$N$8=AX$2,1,0)","v":0},{"$f":"IF(Roster!$N$8=AY$2,1,0)","v":0},{"$f":"IF(Roster!$N$8=AZ$2,1,0)","v":1},{"$f":"IF(Roster!$N$8=BA$2,1,0)","v":0},{"$f":"IF(Roster!$N$8=BB$2,1,0)","v":0},{"$f":"IF(Roster!$N$8=BC$2,1,0)","v":0},{"$f":"IF(Roster!$N$8=BD$2,1,0)","v":0},{"$f":"IF(Roster!$N$8=BE$2,1,0)","v":0},{"$f":"IF(Roster!$O$8=BF$2,1,0)","v":0},{"$f":"IF(Roster!$O$8=BG$2,1,0)","v":0},{"$f":"IF(Roster!$O$8=BH$2,1,0)","v":0},{"$f":"IF(Roster!$O$8=BI$2,1,0)","v":0},{"$f":"IF(Roster!$O$8=BJ$2,1,0)","v":0},{"$f":"IF(Roster!$O$8=BK$2,1,0)","v":0},{"$f":"IF(Roster!$O$8=BL$2,1,0)","v":0},{"$f":"IF(Roster!$O$8=BM$2,1,0)","v":1},{"$f":"IF(Roster!$O$8=BN$2,1,0)","v":0},{"$f":"IF(Roster!$O$8=BO$2,1,0)","v":0},{"$f":"IF(Roster!$O$8=BP$2,1,0)","v":0},{"$f":"IF(Roster!$O$8=BQ$2,1,0)","v":0},{"$f":"IF(Roster!$P$8=BR$2,1,0)","v":0},{"$f":"IF(Roster!$P$8=BS$2,1,0)","v":0},{"$f":"IF(Roster!$P$8=BT$2,1,0)","v":0},{"$f":"IF(Roster!$P$8=BU$2,1,0)","v":0},{"$f":"IF(Roster!$P$8=BV$2,1,0)","v":0},{"$f":"IF(Roster!$P$8=BW$2,1,0)","v":0},{"$f":"IF(Roster!$P$8=BX$2,1,0)","v":0},{"$f":"IF(Roster!$P$8=BY$2,1,0)","v":0},{"$f":"IF(Roster!$P$8=BZ$2,1,0)","v":1},{"$f":"IF(Roster!$P$8=CA$2,1,0)","v":0},{"$f":"IF(Roster!$P$8=CB$2,1,0)","v":0},{"$f":"IF(Roster!$P$8=CC$2,1,0)","v":0},null,"Saturday","Sat"]
[{"$f":"Roster!K9","v":10},{"$f":"Roster!L9","v":11},{"$f":"Roster!M9","v":12},{"$f":"Roster!N9","v":1},{"$f":"Roster!O9","v":2},{"$f":"Roster!P9","v":3},{"$f":"Roster!A9","v":8},{"$f":"IF(ISBLANK(Roster!D9),\"\",Roster!D9)","v":"Ike"},{"$f":"IF(H11=\"\",\"\",INDEX(Water,18,$G11)+INDEX(Stoves_Fuel,18,$G11)+INDEX(Meal_Cleanup,18,$G11)+INDEX(Site_Setup,18,$G11)+INDEX(Bear_Bags,18,$G11)+INDEX(Cook_Dinner,18,$G11))","v":7},{"$f":"IF(Roster!$K$9=J$2,1,0)","v":0},{"$f":"IF(Roster!$K$9=K$2,1,0)","v":0},{"$f":"IF(Roster!$K$9=L$2,1,0)","v":0},{"$f":"IF(Roster!$K$9=M$2,1,0)","v":0},{"$f":"IF(Roster!$K$9=N$2,1,0)","v":0},{"$f":"IF(Roster!$K$9=O$2,1,0)","v":0},{"$f":"IF(Roster!$K$9=P$2,1,0)","v":0},{"$f":"IF(Roster!$K$9=Q$2,1,0)","v":0},{"$f":"IF(Roster!$K$9=R$2,1,0)","v":0},{"$f":"IF(Roster!$K$9=S$2,1,0)","v":1},{"$f":"IF(Roster!$K$9=T$2,1,0)","v":0},{"$f":"IF(Roster!$K$9=U$2,1,0)","v":0},{"$f":"IF(Roster!$L$9=V$2,1,0)","v":0},{"$f":"IF(Roster!$L$9=W$2,1,0)","v":0},{"$f":"IF(Roster!$L$9=X$2,1,0)","v":0},{"$f":"IF(Roster!$L$9=Y$2,1,0)","v":0},{"$f":"IF(Roster!$L$9=Z$2,1,0)","v":0},{"$f":"IF(Roster!$L$9=AA$2,1,0)","v":0},{"$f":"IF(Roster!$L$9=AB$2,1,0)","v":0},{"$f":"IF(Roster!$L$9=AC$2,1,0)","v":0},{"$f":"IF(Roster!$L$9=AD$2,1,0)","v":0},{"$f":"IF(Roster!$L$9=AE$2,1,0)","v":0},{"$f":"IF(Roster!$L$9=AF$2,1,0)","v":1},{"$f":"IF(Roster!$L$9=AG$2,1,0)","v":0},{"$f":"IF(Roster!$M$9=AH$2,1,0)","v":0},{"$f":"IF(Roster!$M$9=AI$2,1,0)","v":0},{"$f":"IF(Roster!$M$9=AJ$2,1,0)","v":0},{"$f":"IF(Roster!$M$9=AK$2,1,0)","v":0},{"$f":"IF(Roster!$M$9=AL$2,1,0)","v":0},{"$f":"IF(Roster!$M$9=AM$2,1,0)","v":0},{"$f":"IF(Roster!$M$9=AN$2,1,0)","v":0},{"$f":"IF(Roster!$M$9=AO$2,1,0)","v":0},{"$f":"IF(Roster!$M$9=AP$2,1,0)","v":0},{"$f":"IF(Roster!$M$9=AQ$2,1,0)","v":0},{"$f":"IF(Roster!$M$9=AR$2,1,0)","v":0},{"$f":"IF(Roster!$M$9=AS$2,1,0)","v":1},{"$f":"IF(Roster!$N$9=AT$2,1,0)","v":1},{"$f":"IF(Roster!$N$9=AU$2,1,0)","v":0},{"$f":"IF(Roster!$N$9=AV$2,1,0)","v":0},{"$f":"IF(Roster!$N$9=AW$2,1,0)","v":0},{"$f":"IF(Roster!$N$9=AX$2,1,0)","v":0},{"$f":"IF(Roster!$N$9=AY$2,1,0)","v":0},{"$f":"IF(Roster!$N$9=AZ$2,1,0)","v":0},{"$f":"IF(Roster!$N$9=BA$2,1,0)","v":0},{"$f":"IF(Roster!$N$9=BB$2,1,0)","v":0},{"$f":"IF(Roster!$N$9=BC$2,1,0)","v":0},{"$f":"IF(Roster!$N$9=BD$2,1,0)","v":0},{"$f":"IF(Roster!$N$9=BE$2,1,0)","v":0},{"$f":"IF(Roster!$O$9=BF$2,1,0)","v":0},{"$f":"IF(Roster!$O$9=BG$2,1,0)","v":1},{"$f":"IF(Roster!$O$9=BH$2,1,0)","v":0},{"$f":"IF(Roster!$O$9=BI$2,1,0)","v":0},{"$f":"IF(Roster!$O$9=BJ$2,1,0)","v":0},{"$f":"IF(Roster!$O$9=BK$2,1,0)","v":0},{"$f":"IF(Roster!$O$9=BL$2,1,0)","v":0},{"$f":"IF(Roster!$O$9=BM$2,1,0)","v":0},{"$f":"IF(Roster!$O$9=BN$2,1,0)","v":0},{"$f":"IF(Roster!$O$9=BO$2,1,0)","v":0},{"$f":"IF(Roster!$O$9=BP$2,1,0)","v":0},{"$f":"IF(Roster!$O$9=BQ$2,1,0)","v":0},{"$f":"IF(Roster!$P$9=BR$2,1,0)","v":0},{"$f":"IF(Roster!$P$9=BS$2,1,0)","v":0},{"$f":"IF(Roster!$P$9=BT$2,1,0)","v":1},{"$f":"IF(Roster!$P$9=BU$2,1,0)","v":0},{"$f":"IF(Roster!$P$9=BV$2,1,0)","v":0},{"$f":"IF(Roster!$P$9=BW$2,1,0)","v":0},{"$f":"IF(Roster!$P$9=BX$2,1,0)","v":0},{"$f":"IF(Roster!$P$9=BY$2,1,0)","v":0},{"$f":"IF(Roster!$P$9=BZ$2,1,0)","v":0},{"$f":"IF(Roster!$P$9=CA$2,1,0)","v":0},{"$f":"IF(Roster!$P$9=CB$2,1,0)","v":0},{"$f":"IF(Roster!$P$9=CC$2,1,0)","v":0}]
[{"$f":"Roster!K10","v":5},{"$f":"Roster!L10","v":6},{"$f":"Roster!M10","v":7},{"$f":"Roster!N10","v":8},{"$f":"Roster!O10","v":9},{"$f":"Roster!P10","v":10},{"$f":"Roster!A10","v":9},{"$f":"IF(ISBLANK(Roster!D10),\"\",Roster!D10)","v":"John"},{"$f":"IF(H12=\"\",\"\",INDEX(Water,18,$G12)+INDEX(Stoves_Fuel,18,$G12)+INDEX(Meal_Cleanup,18,$G12)+INDEX(Site_Setup,18,$G12)+INDEX(Bear_Bags,18,$G12)+INDEX(Cook_Dinner,18,$G12))","v":7},{"$f":"IF(Roster!$K$10=J$2,1,0)","v":0},{"$f":"IF(Roster!$K$10=K$2,1,0)","v":0},{"$f":"IF(Roster!$K$10=L$2,1,0)","v":0},{"$f":"IF(Roster!$K$10=M$2,1,0)","v":0},{"$f":"IF(Roster!$K$10=N$2,1,0)","v":1},{"$f":"IF(Roster!$K$10=O$2,1,0)","v":0},{"$f":"IF(Roster!$K$10=P$2,1,0)","v":0},{"$f":"IF(Roster!$K$10=Q$2,1,0)","v":0},{"$f":"IF(Roster!$K$10=R$2,1,0)","v":0},{"$f":"IF(Roster!$K$10=S$2,1,0)","v":0},{"$f":"IF(Roster!$K$10=T$2,1,0)","v":0},{"$f":"IF(Roster!$K$10=U$2,1,0)","v":0},{"$f":"IF(Roster!$L$10=V$2,1,0)","v":0},{"$f":"IF(Roster!$L$10=W$2,1,0)","v":0},{"$f":"IF(Roster!$L$10=X$2,1,0)","v":0},{"$f":"IF(Roster!$L$10=Y$2,1,0)","v":0},{"$f":"IF(Roster!$L$10=Z$2,1,0)","v":0},{"$f":"IF(Roster!$L$10=AA$2,1,0)","v":1},{"$f":"IF(Roster!$L$10=AB$2,1,0)","v":0},{"$f":"IF(Roster!$L$10=AC$2,1,0)","v":0},{"$f":"IF(Roster!$L$10=AD$2,1,0)","v":0},{"$f":"IF(Roster!$L$10=AE$2,1,0)","v":0},{"$f":"IF(Roster!$L$10=AF$2,1,0)","v":0},{"$f":"IF(Roster!$L$10=AG$2,1,0)","v":0},{"$f":"IF(Roster!$M$10=AH$2,1,0)","v":0},{"$f":"IF(Roster!$M$10=AI$2,1,0)","v":0},{"$f":"IF(Roster!$M$10=AJ$2,1,0)","v":0},{"$f":"IF(Roster!$M$10=AK$2,1,0)","v":0},{"$f":"IF(Roster!$M$10=AL$2,1,0)","v":0},{"$f":"IF(Roster!$M$10=AM$2,1,0)","v":0},{"$f":"IF(Roster!$M$10=AN$2,1,0)","v":1},{"$f":"IF(Roster!$M$10=AO$2,1,0)","v":0},{"$f":"IF(Roster!$M$10=AP$2,1,0)","v":0},{"$f":"IF(Roster!$M$10=AQ$2,1,0)","v":0},{"$f":"IF(Roster!$M$10=AR$2,1,0)","v":0},{"$f":"IF(Roster!$M$10=AS$2,1,0)","v":0},{"$f":"IF(Roster!$N$10=AT$2,1,0)","v":0},{"$f":"IF(Roster!$N$10=AU$2,1,0)","v":0},{"$f":"IF(Roster!$N$10=AV$2,1,0)","v":0},{"$f":"IF(Roster!$N$10=AW$2,1,0)","v":0},{"$f":"IF(Roster!$N$10=AX$2,1,0)","v":0},{"$f":"IF(Roster!$N$10=AY$2,1,0)","v":0},{"$f":"IF(Roster!$N$10=AZ$2,1,0)","v":0},{"$f":"IF(Roster!$N$10=BA$2,1,0)","v":1},{"$f":"IF(Roster!$N$10=BB$2,1,0)","v":0},{"$f":"IF(Roster!$N$10=BC$2,1,0)","v":0},{"$f":"IF(Roster!$N$10=BD$2,1,0)","v":0},{"$f":"IF(Roster!$N$10=BE$2,1,0)","v":0},{"$f":"IF(Roster!$O$10=BF$2,1,0)","v":0},{"$f":"IF(Roster!$O$10=BG$2,1,0)","v":0},{"$f":"IF(Roster!$O$10=BH$2,1,0)","v":0},{"$f":"IF(Roster!$O$10=BI$2,1,0)","v":0},{"$f":"IF(Roster!$O$10=BJ$2,1,0)","v":0},{"$f":"IF(Roster!$O$10=BK$2,1,0)","v":0},{"$f":"IF(Roster!$O$10=BL$2,1,0)","v":0},{"$f":"IF(Roster!$O$10=BM$2,1,0)","v":0},{"$f":"IF(Roster!$O$10=BN$2,1,0)","v":1},{"$f":"IF(Roster!$O$10=BO$2,1,0)","v":0},{"$f":"IF(Roster!$O$10=BP$2,1,0)","v":0},{"$f":"IF(Roster!$O$10=BQ$2,1,0)","v":0},{"$f":"IF(Roster!$P$10=BR$2,1,0)","v":0},{"$f":"IF(Roster!$P$10=BS$2,1,0)","v":0},{"$f":"IF(Roster!$P$10=BT$2,1,0)","v":0},{"$f":"IF(Roster!$P$10=BU$2,1,0)","v":0},{"$f":"IF(Roster!$P$10=BV$2,1,0)","v":0},{"$f":"IF(Roster!$P$10=BW$2,1,0)","v":0},{"$f":"IF(Roster!$P$10=BX$2,1,0)","v":0},{"$f":"IF(Roster!$P$10=BY$2,1,0)","v":0},{"$f":"IF(Roster!$P$10=BZ$2,1,0)","v":0},{"$f":"IF(Roster!$P$10=CA$2,1,0)","v":1},{"$f":"IF(Roster!$P$10=CB$2,1,0)","v":0},{"$f":"IF(Roster!$P$10=CC$2,1,0)","v":0}]
[{"$f":"Roster!K11","v":11},{"$f":"Roster!L11","v":12},{"$f":"Roster!M11","v":1},{"$f":"Roster!N11","v":2},{"$f":"Roster!O11","v":3},{"$f":"Roster!P11","v":4},{"$f":"Roster!A11","v":10},{"$f":"IF(ISBLANK(Roster!D11),\"\",Roster!D11)","v":"Bill"},{"$f":"IF(H13=\"\",\"\",INDEX(Water,18,$G13)+INDEX(Stoves_Fuel,18,$G13)+INDEX(Meal_Cleanup,18,$G13)+INDEX(Site_Setup,18,$G13)+INDEX(Bear_Bags,18,$G13)+INDEX(Cook_Dinner,18,$G13))","v":7},{"$f":"IF(Roster!$K$11=J$2,1,0)","v":0},{"$f":"IF(Roster!$K$11=K$2,1,0)","v":0},{"$f":"IF(Roster!$K$11=L$2,1,0)","v":0},{"$f":"IF(Roster!$K$11=M$2,1,0)","v":0},{"$f":"IF(Roster!$K$11=N$2,1,0)","v":0},{"$f":"IF(Roster!$K$11=O$2,1,0)","v":0},{"$f":"IF(Roster!$K$11=P$2,1,0)","v":0},{"$f":"IF(Roster!$K$11=Q$2,1,0)","v":0},{"$f":"IF(Roster!$K$11=R$2,1,0)","v":0},{"$f":"IF(Roster!$K$11=S$2,1,0)","v":0},{"$f":"IF(Roster!$K$11=T$2,1,0)","v":1},{"$f":"IF(Roster!$K$11=U$2,1,0)","v":0},{"$f":"IF(Roster!$L$11=V$2,1,0)","v":0},{"$f":"IF(Roster!$L$11=W$2,1,0)","v":0},{"$f":"IF(Roster!$L$11=X$2,1,0)","v":0},{"$f":"IF(Roster!$L$11=Y$2,1,0)","v":0},{"$f":"IF(Roster!$L$11=Z$2,1,0)","v":0},{"$f":"IF(Roster!$L$11=AA$2,1,0)","v":0},{"$f":"IF(Roster!$L$11=AB$2,1,0)","v":0},{"$f":"IF(Roster!$L$11=AC$2,1,0)","v":0},{"$f":"IF(Roster!$L$11=AD$2,1,0)","v":0},{"$f":"IF(Roster!$L$11=AE$2,1,0)","v":0},{"$f":"IF(Roster!$L$11=AF$2,1,0)","v":0},{"$f":"IF(Roster!$L$11=AG$2,1,0)","v":1},{"$f":"IF(Roster!$M$11=AH$2,1,0)","v":1},{"$f":"IF(Roster!$M$11=AI$2,1,0)","v":0},{"$f":"IF(Roster!$M$11=AJ$2,1,0)","v":0},{"$f":"IF(Roster!$M$11=AK$2,1,0)","v":0},{"$f":"IF(Roster!$M$11=AL$2,1,0)","v":0},{"$f":"IF(Roster!$M$11=AM$2,1,0)","v":0},{"$f":"IF(Roster!$M$11=AN$2,1,0)","v":0},{"$f":"IF(Roster!$M$11=AO$2,1,0)","v":0},{"$f":"IF(Roster!$M$11=AP$2,1,0)","v":0},{"$f":"IF(Roster!$M$11=AQ$2,1,0)","v":0},{"$f":"IF(Roster!$M$11=AR$2,1,0)","v":0},{"$f":"IF(Roster!$M$11=AS$2,1,0)","v":0},{"$f":"IF(Roster!$N$11=AT$2,1,0)","v":0},{"$f":"IF(Roster!$N$11=AU$2,1,0)","v":1},{"$f":"IF(Roster!$N$11=AV$2,1,0)","v":0},{"$f":"IF(Roster!$N$11=AW$2,1,0)","v":0},{"$f":"IF(Roster!$N$11=AX$2,1,0)","v":0},{"$f":"IF(Roster!$N$11=AY$2,1,0)","v":0},{"$f":"IF(Roster!$N$11=AZ$2,1,0)","v":0},{"$f":"IF(Roster!$N$11=BA$2,1,0)","v":0},{"$f":"IF(Roster!$N$11=BB$2,1,0)","v":0},{"$f":"IF(Roster!$N$11=BC$2,1,0)","v":0},{"$f":"IF(Roster!$N$11=BD$2,1,0)","v":0},{"$f":"IF(Roster!$N$11=BE$2,1,0)","v":0},{"$f":"IF(Roster!$O$11=BF$2,1,0)","v":0},{"$f":"IF(Roster!$O$11=BG$2,1,0)","v":0},{"$f":"IF(Roster!$O$11=BH$2,1,0)","v":1},{"$f":"IF(Roster!$O$11=BI$2,1,0)","v":0},{"$f":"IF(Roster!$O$11=BJ$2,1,0)","v":0},{"$f":"IF(Roster!$O$11=BK$2,1,0)","v":0},{"$f":"IF(Roster!$O$11=BL$2,1,0)","v":0},{"$f":"IF(Roster!$O$11=BM$2,1,0)","v":0},{"$f":"IF(Roster!$O$11=BN$2,1,0)","v":0},{"$f":"IF(Roster!$O$11=BO$2,1,0)","v":0},{"$f":"IF(Roster!$O$11=BP$2,1,0)","v":0},{"$f":"IF(Roster!$O$11=BQ$2,1,0)","v":0},{"$f":"IF(Roster!$P$11=BR$2,1,0)","v":0},{"$f":"IF(Roster!$P$11=BS$2,1,0)","v":0},{"$f":"IF(Roster!$P$11=BT$2,1,0)","v":0},{"$f":"IF(Roster!$P$11=BU$2,1,0)","v":1},{"$f":"IF(Roster!$P$11=BV$2,1,0)","v":0},{"$f":"IF(Roster!$P$11=BW$2,1,0)","v":0},{"$f":"IF(Roster!$P$11=BX$2,1,0)","v":0},{"$f":"IF(Roster!$P$11=BY$2,1,0)","v":0},{"$f":"IF(Roster!$P$11=BZ$2,1,0)","v":0},{"$f":"IF(Roster!$P$11=CA$2,1,0)","v":0},{"$f":"IF(Roster!$P$11=CB$2,1,0)","v":0},{"$f":"IF(Roster!$P$11=CC$2,1,0)","v":0}]
[{"$f":"Roster!K12","v":6},{"$f":"Roster!L12","v":7},{"$f":"Roster!M12","v":8},{"$f":"Roster!N12","v":9},{"$f":"Roster!O12","v":10},{"$f":"Roster!P12","v":11},{"$f":"Roster!A12","v":11},{"$f":"IF(ISBLANK(Roster!D12),\"\",Roster!D12)","v":"Waite"},{"$f":"IF(H14=\"\",\"\",INDEX(Water,18,$G14)+INDEX(Stoves_Fuel,18,$G14)+INDEX(Meal_Cleanup,18,$G14)+INDEX(Site_Setup,18,$G14)+INDEX(Bear_Bags,18,$G14)+INDEX(Cook_Dinner,18,$G14))","v":7},{"$f":"IF(Roster!$K$12=J$2,1,0)","v":0},{"$f":"IF(Roster!$K$12=K$2,1,0)","v":0},{"$f":"IF(Roster!$K$12=L$2,1,0)","v":0},{"$f":"IF(Roster!$K$12=M$2,1,0)","v":0},{"$f":"IF(Roster!$K$12=N$2,1,0)","v":0},{"$f":"IF(Roster!$K$12=O$2,1,0)","v":1},{"$f":"IF(Roster!$K$12=P$2,1,0)","v":0},{"$f":"IF(Roster!$K$12=Q$2,1,0)","v":0},{"$f":"IF(Roster!$K$12=R$2,1,0)","v":0},{"$f":"IF(Roster!$K$12=S$2,1,0)","v":0},{"$f":"IF(Roster!$K$12=T$2,1,0)","v":0},{"$f":"IF(Roster!$K$12=U$2,1,0)","v":0},{"$f":"IF(Roster!$L$12=V$2,1,0)","v":0},{"$f":"IF(Roster!$L$12=W$2,1,0)","v":0},{"$f":"IF(Roster!$L$12=X$2,1,0)","v":0},{"$f":"IF(Roster!$L$12=Y$2,1,0)","v":0},{"$f":"IF(Roster!$L$12=Z$2,1,0)","v":0},{"$f":"IF(Roster!$L$12=AA$2,1,0)","v":0},{"$f":"IF(Roster!$L$12=AB$2,1,0)","v":1},{"$f":"IF(Roster!$L$12=AC$2,1,0)","v":0},{"$f":"IF(Roster!$L$12=AD$2,1,0)","v":0},{"$f":"IF(Roster!$L$12=AE$2,1,0)","v":0},{"$f":"IF(Roster!$L$12=AF$2,1,0)","v":0},{"$f":"IF(Roster!$L$12=AG$2,1,0)","v":0},{"$f":"IF(Roster!$M$12=AH$2,1,0)","v":0},{"$f":"IF(Roster!$M$12=AI$2,1,0)","v":0},{"$f":"IF(Roster!$M$12=AJ$2,1,0)","v":0},{"$f":"IF(Roster!$M$12=AK$2,1,0)","v":0},{"$f":"IF(Roster!$M$12=AL$2,1,0)","v":0},{"$f":"IF(Roster!$M$12=AM$2,1,0)","v":0},{"$f":"IF(Roster!$M$12=AN$2,1,0)","v":0},{"$f":"IF(Roster!$M$12=AO$2,1,0)","v":1},{"$f":"IF(Roster!$M$12=AP$2,1,0)","v":0},{"$f":"IF(Roster!$M$12=AQ$2,1,0)","v":0},{"$f":"IF(Roster!$M$12=AR$2,1,0)","v":0},{"$f":"IF(Roster!$M$12=AS$2,1,0)","v":0},{"$f":"IF(Roster!$N$12=AT$2,1,0)","v":0},{"$f":"IF(Roster!$N$12=AU$2,1,0)","v":0},{"$f":"IF(Roster!$N$12=AV$2,1,0)","v":0},{"$f":"IF(Roster!$N$12=AW$2,1,0)","v":0},{"$f":"IF(Roster!$N$12=AX$2,1,0)","v":0},{"$f":"IF(Roster!$N$12=AY$2,1,0)","v":0},{"$f":"IF(Roster!$N$12=AZ$2,1,0)","v":0},{"$f":"IF(Roster!$N$12=BA$2,1,0)","v":0},{"$f":"IF(Roster!$N$12=BB$2,1,0)","v":1},{"$f":"IF(Roster!$N$12=BC$2,1,0)","v":0},{"$f":"IF(Roster!$N$12=BD$2,1,0)","v":0},{"$f":"IF(Roster!$N$12=BE$2,1,0)","v":0},{"$f":"IF(Roster!$O$12=BF$2,1,0)","v":0},{"$f":"IF(Roster!$O$12=BG$2,1,0)","v":0},{"$f":"IF(Roster!$O$12=BH$2,1,0)","v":0},{"$f":"IF(Roster!$O$12=BI$2,1,0)","v":0},{"$f":"IF(Roster!$O$12=BJ$2,1,0)","v":0},{"$f":"IF(Roster!$O$12=BK$2,1,0)","v":0},{"$f":"IF(Roster!$O$12=BL$2,1,0)","v":0},{"$f":"IF(Roster!$O$12=BM$2,1,0)","v":0},{"$f":"IF(Roster!$O$12=BN$2,1,0)","v":0},{"$f":"IF(Roster!$O$12=BO$2,1,0)","v":1},{"$f":"IF(Roster!$O$12=BP$2,1,0)","v":0},{"$f":"IF(Roster!$O$12=BQ$2,1,0)","v":0},{"$f":"IF(Roster!$P$12=BR$2,1,0)","v":0},{"$f":"IF(Roster!$P$12=BS$2,1,0)","v":0},{"$f":"IF(Roster!$P$12=BT$2,1,0)","v":0},{"$f":"IF(Roster!$P$12=BU$2,1,0)","v":0},{"$f":"IF(Roster!$P$12=BV$2,1,0)","v":0},{"$f":"IF(Roster!$P$12=BW$2,1,0)","v":0},{"$f":"IF(Roster!$P$12=BX$2,1,0)","v":0},{"$f":"IF(Roster!$P$12=BY$2,1,0)","v":0},{"$f":"IF(Roster!$P$12=BZ$2,1,0)","v":0},{"$f":"IF(Roster!$P$12=CA$2,1,0)","v":0},{"$f":"IF(Roster!$P$12=CB$2,1,0)","v":1},{"$f":"IF(Roster!$P$12=CC$2,1,0)","v":0}]
[{"$f":"Roster!K13","v":12},{"$f":"Roster!L13","v":1},{"$f":"Roster!M13","v":2},{"$f":"Roster!N13","v":3},{"$f":"Roster!O13","v":4},{"$f":"Roster!P13","v":5},{"$f":"Roster!A13","v":12},{"$f":"IF(ISBLANK(Roster!D13),\"\",Roster!D13)","v":"George"},{"$f":"IF(H15=\"\",\"\",INDEX(Water,18,$G15)+INDEX(Stoves_Fuel,18,$G15)+INDEX(Meal_Cleanup,18,$G15)+INDEX(Site_Setup,18,$G15)+INDEX(Bear_Bags,18,$G15)+INDEX(Cook_Dinner,18,$G15))","v":7},{"$f":"IF(Roster!$K$13=J$2,1,0)","v":0},{"$f":"IF(Roster!$K$13=K$2,1,0)","v":0},{"$f":"IF(Roster!$K$13=L$2,1,0)","v":0},{"$f":"IF(Roster!$K$13=M$2,1,0)","v":0},{"$f":"IF(Roster!$K$13=N$2,1,0)","v":0},{"$f":"IF(Roster!$K$13=O$2,1,0)","v":0},{"$f":"IF(Roster!$K$13=P$2,1,0)","v":0},{"$f":"IF(Roster!$K$13=Q$2,1,0)","v":0},{"$f":"IF(Roster!$K$13=R$2,1,0)","v":0},{"$f":"IF(Roster!$K$13=S$2,1,0)","v":0},{"$f":"IF(Roster!$K$13=T$2,1,0)","v":0},{"$f":"IF(Roster!$K$13=U$2,1,0)","v":1},{"$f":"IF(Roster!$L$13=V$2,1,0)","v":1},{"$f":"IF(Roster!$L$13=W$2,1,0)","v":0},{"$f":"IF(Roster!$L$13=X$2,1,0)","v":0},{"$f":"IF(Roster!$L$13=Y$2,1,0)","v":0},{"$f":"IF(Roster!$L$13=Z$2,1,0)","v":0},{"$f":"IF(Roster!$L$13=AA$2,1,0)","v":0},{"$f":"IF(Roster!$L$13=AB$2,1,0)","v":0},{"$f":"IF(Roster!$L$13=AC$2,1,0)","v":0},{"$f":"IF(Roster!$L$13=AD$2,1,0)","v":0},{"$f":"IF(Roster!$L$13=AE$2,1,0)","v":0},{"$f":"IF(Roster!$L$13=AF$2,1,0)","v":0},{"$f":"IF(Roster!$L$13=AG$2,1,0)","v":0},{"$f":"IF(Roster!$M$13=AH$2,1,0)","v":0},{"$f":"IF(Roster!$M$13=AI$2,1,0)","v":1},{"$f":"IF(Roster!$M$13=AJ$2,1,0)","v":0},{"$f":"IF(Roster!$M$13=AK$2,1,0)","v":0},{"$f":"IF(Roster!$M$13=AL$2,1,0)","v":0},{"$f":"IF(Roster!$M$13=AM$2,1,0)","v":0},{"$f":"IF(Roster!$M$13=AN$2,1,0)","v":0},{"$f":"IF(Roster!$M$13=AO$2,1,0)","v":0},{"$f":"IF(Roster!$M$13=AP$2,1,0)","v":0},{"$f":"IF(Roster!$M$13=AQ$2,1,0)","v":0},{"$f":"IF(Roster!$M$13=AR$2,1,0)","v":0},{"$f":"IF(Roster!$M$13=AS$2,1,0)","v":0},{"$f":"IF(Roster!$N$13=AT$2,1,0)","v":0},{"$f":"IF(Roster!$N$13=AU$2,1,0)","v":0},{"$f":"IF(Roster!$N$13=AV$2,1,0)","v":1},{"$f":"IF(Roster!$N$13=AW$2,1,0)","v":0},{"$f":"IF(Roster!$N$13=AX$2,1,0)","v":0},{"$f":"IF(Roster!$N$13=AY$2,1,0)","v":0},{"$f":"IF(Roster!$N$13=AZ$2,1,0)","v":0},{"$f":"IF(Roster!$N$13=BA$2,1,0)","v":0},{"$f":"IF(Roster!$N$13=BB$2,1,0)","v":0},{"$f":"IF(Roster!$N$13=BC$2,1,0)","v":0},{"$f":"IF(Roster!$N$13=BD$2,1,0)","v":0},{"$f":"IF(Roster!$N$13=BE$2,1,0)","v":0},{"$f":"IF(Roster!$O$13=BF$2,1,0)","v":0},{"$f":"IF(Roster!$O$13=BG$2,1,0)","v":0},{"$f":"IF(Roster!$O$13=BH$2,1,0)","v":0},{"$f":"IF(Roster!$O$13=BI$2,1,0)","v":1},{"$f":"IF(Roster!$O$13=BJ$2,1,0)","v":0},{"$f":"IF(Roster!$O$13=BK$2,1,0)","v":0},{"$f":"IF(Roster!$O$13=BL$2,1,0)","v":0},{"$f":"IF(Roster!$O$13=BM$2,1,0)","v":0},{"$f":"IF(Roster!$O$13=BN$2,1,0)","v":0},{"$f":"IF(Roster!$O$13=BO$2,1,0)","v":0},{"$f":"IF(Roster!$O$13=BP$2,1,0)","v":0},{"$f":"IF(Roster!$O$13=BQ$2,1,0)","v":0},{"$f":"IF(Roster!$P$13=BR$2,1,0)","v":0},{"$f":"IF(Roster!$P$13=BS$2,1,0)","v":0},{"$f":"IF(Roster!$P$13=BT$2,1,0)","v":0},{"$f":"IF(Roster!$P$13=BU$2,1,0)","v":0},{"$f":"IF(Roster!$P$13=BV$2,1,0)","v":1},{"$f":"IF(Roster!$P$13=BW$2,1,0)","v":0},{"$f":"IF(Roster!$P$13=BX$2,1,0)","v":0},{"$f":"IF(Roster!$P$13=BY$2,1,0)","v":0},{"$f":"IF(Roster!$P$13=BZ$2,1,0)","v":0},{"$f":"IF(Roster!$P$13=CA$2,1,0)","v":0},{"$f":"IF(Roster!$P$13=CB$2,1,0)","v":0},{"$f":"IF(Roster!$P$13=CC$2,1,0)","v":0}]
[{"$f":"Roster!K14","v":7},{"$f":"Roster!L14","v":8},{"$f":"Roster!M14","v":9},{"$f":"Roster!N14","v":10},{"$f":"Roster!O14","v":11},{"$f":"Roster!P14","v":12},null,null,null,{"$f":"IF(Roster!$K$14=J$2,1,0)","v":0},{"$f":"IF(Roster!$K$14=K$2,1,0)","v":0},{"$f":"IF(Roster!$K$14=L$2,1,0)","v":0},{"$f":"IF(Roster!$K$14=M$2,1,0)","v":0},{"$f":"IF(Roster!$K$14=N$2,1,0)","v":0},{"$f":"IF(Roster!$K$14=O$2,1,0)","v":0},{"$f":"IF(Roster!$K$14=P$2,1,0)","v":1},{"$f":"IF(Roster!$K$14=Q$2,1,0)","v":0},{"$f":"IF(Roster!$K$14=R$2,1,0)","v":0},{"$f":"IF(Roster!$K$14=S$2,1,0)","v":0},{"$f":"IF(Roster!$K$14=T$2,1,0)","v":0},{"$f":"IF(Roster!$K$14=U$2,1,0)","v":0},{"$f":"IF(Roster!$L$14=V$2,1,0)","v":0},{"$f":"IF(Roster!$L$14=W$2,1,0)","v":0},{"$f":"IF(Roster!$L$14=X$2,1,0)","v":0},{"$f":"IF(Roster!$L$14=Y$2,1,0)","v":0},{"$f":"IF(Roster!$L$14=Z$2,1,0)","v":0},{"$f":"IF(Roster!$L$14=AA$2,1,0)","v":0},{"$f":"IF(Roster!$L$14=AB$2,1,0)","v":0},{"$f":"IF(Roster!$L$14=AC$2,1,0)","v":1},{"$f":"IF(Roster!$L$14=AD$2,1,0)","v":0},{"$f":"IF(Roster!$L$14=AE$2,1,0)","v":0},{"$f":"IF(Roster!$L$14=AF$2,1,0)","v":0},{"$f":"IF(Roster!$L$14=AG$2,1,0)","v":0},{"$f":"IF(Roster!$M$14=AH$2,1,0)","v":0},{"$f":"IF(Roster!$M$14=AI$2,1,0)","v":0},{"$f":"IF(Roster!$M$14=AJ$2,1,0)","v":0},{"$f":"IF(Roster!$M$14=AK$2,1,0)","v":0},{"$f":"IF(Roster!$M$14=AL$2,1,0)","v":0},{"$f":"IF(Roster!$M$14=AM$2,1,0)","v":0},{"$f":"IF(Roster!$M$14=AN$2,1,0)","v":0},{"$f":"IF(Roster!$M$14=AO$2,1,0)","v":0},{"$f":"IF(Roster!$M$14=AP$2,1,0)","v":1},{"$f":"IF(Roster!$M$14=AQ$2,1,0)","v":0},{"$f":"IF(Roster!$M$14=AR$2,1,0)","v":0},{"$f":"IF(Roster!$M$14=AS$2,1,0)","v":0},{"$f":"IF(Roster!$N$14=AT$2,1,0)","v":0},{"$f":"IF(Roster!$N$14=AU$2,1,0)","v":0},{"$f":"IF(Roster!$N$14=AV$2,1,0)","v":0},{"$f":"IF(Roster!$N$14=AW$2,1,0)","v":0},{"$f":"IF(Roster!$N$14=AX$2,1,0)","v":0},{"$f":"IF(Roster!$N$14=AY$2,1,0)","v":0},{"$f":"IF(Roster!$N$14=AZ$2,1,0)","v":0},{"$f":"IF(Roster!$N$14=BA$2,1,0)","v":0},{"$f":"IF(Roster!$N$14=BB$2,1,0)","v":0},{"$f":"IF(Roster!$N$14=BC$2,1,0)","v":1},{"$f":"IF(Roster!$N$14=BD$2,1,0)","v":0},{"$f":"IF(Roster!$N$14=BE$2,1,0)","v":0},{"$f":"IF(Roster!$O$14=BF$2,1,0)","v":0},{"$f":"IF(Roster!$O$14=BG$2,1,0)","v":0},{"$f":"IF(Roster!$O$14=BH$2,1,0)","v":0},{"$f":"IF(Roster!$O$14=BI$2,1,0)","v":0},{"$f":"IF(Roster!$O$14=BJ$2,1,0)","v":0},{"$f":"IF(Roster!$O$14=BK$2,1,0)","v":0},{"$f":"IF(Roster!$O$14=BL$2,1,0)","v":0},{"$f":"IF(Roster!$O$14=BM$2,1,0)","v":0},{"$f":"IF(Roster!$O$14=BN$2,1,0)","v":0},{"$f":"IF(Roster!$O$14=BO$2,1,0)","v":0},{"$f":"IF(Roster!$O$14=BP$2,1,0)","v":1},{"$f":"IF(Roster!$O$14=BQ$2,1,0)","v":0},{"$f":"IF(Roster!$P$14=BR$2,1,0)","v":0},{"$f":"IF(Roster!$P$14=BS$2,1,0)","v":0},{"$f":"IF(Roster!$P$14=BT$2,1,0)","v":0},{"$f":"IF(Roster!$P$14=BU$2,1,0)","v":0},{"$f":"IF(Roster!$P$14=BV$2,1,0)","v":0},{"$f":"IF(Roster!$P$14=BW$2,1,0)","v":0},{"$f":"IF(Roster!$P$14=BX$2,1,0)","v":0},{"$f":"IF(Roster!$P$14=BY$2,1,0)","v":0},{"$f":"IF(Roster!$P$14=BZ$2,1,0)","v":0},{"$f":"IF(Roster!$P$14=CA$2,1,0)","v":0},{"$f":"IF(Roster!$P$14=CB$2,1,0)","v":0},{"$f":"IF(Roster!$P$14=CC$2,1,0)","v":1}]
[{"$f":"Roster!K15","v":1},{"$f":"Roster!L15","v":2},{"$f":"Roster!M15","v":3},{"$f":"Roster!N15","v":4},{"$f":"Roster!O15","v":5},{"$f":"Roster!P15","v":6},null,null,null,{"$f":"IF(Roster!$K$15=J$2,1,0)","v":1},{"$f":"IF(Roster!$K$15=K$2,1,0)","v":0},{"$f":"IF(Roster!$K$15=L$2,1,0)","v":0},{"$f":"IF(Roster!$K$15=M$2,1,0)","v":0},{"$f":"IF(Roster!$K$15=N$2,1,0)","v":0},{"$f":"IF(Roster!$K$15=O$2,1,0)","v":0},{"$f":"IF(Roster!$K$15=P$2,1,0)","v":0},{"$f":"IF(Roster!$K$15=Q$2,1,0)","v":0},{"$f":"IF(Roster!$K$15=R$2,1,0)","v":0},{"$f":"IF(Roster!$K$15=S$2,1,0)","v":0},{"$f":"IF(Roster!$K$15=T$2,1,0)","v":0},{"$f":"IF(Roster!$K$15=U$2,1,0)","v":0},{"$f":"IF(Roster!$L$15=V$2,1,0)","v":0},{"$f":"IF(Roster!$L$15=W$2,1,0)","v":1},{"$f":"IF(Roster!$L$15=X$2,1,0)","v":0},{"$f":"IF(Roster!$L$15=Y$2,1,0)","v":0},{"$f":"IF(Roster!$L$15=Z$2,1,0)","v":0},{"$f":"IF(Roster!$L$15=AA$2,1,0)","v":0},{"$f":"IF(Roster!$L$15=AB$2,1,0)","v":0},{"$f":"IF(Roster!$L$15=AC$2,1,0)","v":0},{"$f":"IF(Roster!$L$15=AD$2,1,0)","v":0},{"$f":"IF(Roster!$L$15=AE$2,1,0)","v":0},{"$f":"IF(Roster!$L$15=AF$2,1,0)","v":0},{"$f":"IF(Roster!$L$15=AG$2,1,0)","v":0},{"$f":"IF(Roster!$M$15=AH$2,1,0)","v":0},{"$f":"IF(Roster!$M$15=AI$2,1,0)","v":0},{"$f":"IF(Roster!$M$15=AJ$2,1,0)","v":1},{"$f":"IF(Roster!$M$15=AK$2,1,0)","v":0},{"$f":"IF(Roster!$M$15=AL$2,1,0)","v":0},{"$f":"IF(Roster!$M$15=AM$2,1,0)","v":0},{"$f":"IF(Roster!$M$15=AN$2,1,0)","v":0},{"$f":"IF(Roster!$M$15=AO$2,1,0)","v":0},{"$f":"IF(Roster!$M$15=AP$2,1,0)","v":0},{"$f":"IF(Roster!$M$15=AQ$2,1,0)","v":0},{"$f":"IF(Roster!$M$15=AR$2,1,0)","v":0},{"$f":"IF(Roster!$M$15=AS$2,1,0)","v":0},{"$f":"IF(Roster!$N$15=AT$2,1,0)","v":0},{"$f":"IF(Roster!$N$15=AU$2,1,0)","v":0},{"$f":"IF(Roster!$N$15=AV$2,1,0)","v":0},{"$f":"IF(Roster!$N$15=AW$2,1,0)","v":1},{"$f":"IF(Roster!$N$15=AX$2,1,0)","v":0},{"$f":"IF(Roster!$N$15=AY$2,1,0)","v":0},{"$f":"IF(Roster!$N$15=AZ$2,1,0)","v":0},{"$f":"IF(Roster!$N$15=BA$2,1,0)","v":0},{"$f":"IF(Roster!$N$15=BB$2,1,0)","v":0},{"$f":"IF(Roster!$N$15=BC$2,1,0)","v":0},{"$f":"IF(Roster!$N$15=BD$2,1,0)","v":0},{"$f":"IF(Roster!$N$15=BE$2,1,0)","v":0},{"$f":"IF(Roster!$O$15=BF$2,1,0)","v":0},{"$f":"IF(Roster!$O$15=BG$2,1,0)","v":0},{"$f":"IF(Roster!$O$15=BH$2,1,0)","v":0},{"$f":"IF(Roster!$O$15=BI$2,1,0)","v":0},{"$f":"IF(Roster!$O$15=BJ$2,1,0)","v":1},{"$f":"IF(Roster!$O$15=BK$2,1,0)","v":0},{"$f":"IF(Roster!$O$15=BL$2,1,0)","v":0},{"$f":"IF(Roster!$O$15=BM$2,1,0)","v":0},{"$f":"IF(Roster!$O$15=BN$2,1,0)","v":0},{"$f":"IF(Roster!$O$15=BO$2,1,0)","v":0},{"$f":"IF(Roster!$O$15=BP$2,1,0)","v":0},{"$f":"IF(Roster!$O$15=BQ$2,1,0)","v":0},{"$f":"IF(Roster!$P$15=BR$2,1,0)","v":0},{"$f":"IF(Roster!$P$15=BS$2,1,0)","v":0},{"$f":"IF(Roster!$P$15=BT$2,1,0)","v":0},{"$f":"IF(Roster!$P$15=BU$2,1,0)","v":0},{"$f":"IF(Roster!$P$15=BV$2,1,0)","v":0},{"$f":"IF(Roster!$P$15=BW$2,1,0)","v":1},{"$f":"IF(Roster!$P$15=BX$2,1,0)","v":0},{"$f":"IF(Roster!$P$15=BY$2,1,0)","v":0},{"$f":"IF(Roster!$P$15=BZ$2,1,0)","v":0},{"$f":"IF(Roster!$P$15=CA$2,1,0)","v":0},{"$f":"IF(Roster!$P$15=CB$2,1,0)","v":0},{"$f":"IF(Roster!$P$15=CC$2,1,0)","v":0}]
[null,null,null,null,null,null,null,null,null,{"$f":"SUM(J4:J17)","v":2},1,1,1,1,1,2,1,1,1,1,1,1,2,1,1,1,1,1,2,1,1,1,1,1,1,2,1,1,1,1,1,{"$f":"SUM(AP4:AP17)","v":2},1,1,1,1,1,1,2,1,1,1,1,1,2,1,1,1,1,1,1,2,1,1,1,1,1,2,1,1,1,1,1,{"$f":"SUM(BV4:BV17)","v":1},{"$f":"SUM(BW4:BW17)","v":2},1,1,1,1,1,2]

{"sheet":"Tables","index":4,"n_rows":170,"n_cols":19,"rows_kept":170,"cut":false,"hidden":true,"merged":[[16,0,16,10]]}
["Itinerary","Day 2","Day 3","Day 4","Day 5","Day 6","Day 7","Day 8","Day 9","Day 10","Day 11",null,"CAMP NAME","Type","Showers","Commissary","Trading Post","Trail Camp","Dry Camp"]
["9-1","Harlan","Devil's Wash Basin","Cimarroncita","Black Jacks","Elkhorn","Ponil","Indian Writings",null,null,null,null,"Abreu","S","Y","","","",""]
["9-2","House Canyon","Indian Writings","Metcalf Station","Bluestem","Pueblano","Black Horse Mine","Maxwell",null,null,null,null,"Agua Fria","T","","","","Y",""]
["9-3","Ponderosa Park","Miners Park","Black Mountain","Beaubien","Beaubien","Comanche Peak","Clear Creek",null,null,null,null,"Aguila","T","","","","Y",""]
["9-4","Heck Meadow","Clarks Fork","Cimarroncito","Whistle Punk","Sawmill","Divide","Tolby Headwaters",null,null,null,null,"American Creek","T",null,null,null,"Y",""]
["9-5","Dean Skyline","Upper Dean Cow","French Henry","Copper Park","Copper Park","Rich Cabins","Ponil",null,null,null,null,"Anasazi","T","","","","Y",""]
["9-6","Sioux","Pueblano","Touch-Me-Not Creek","Touch-Me-Not Creek","Baldy Skyline","Upper Dean Cow","Cimarroncita",null,null,null,null,"Apache Springs","S","","Y","","",""]
["9-7","McBride Canyon","Metcalf Station","Ponil","Pueblano","Azurite","Azurite","Miranda",null,null,null,null,"Arrowhead","T",null,null,null,"Y","Y"]
["9-8","Aguila","Miners Park","Clarks Fork","Cimarroncito","Lamberts Mine","Thunder Ridge","American Creek",null,null,null,null,"Aspen Springs","T","","","","Y",""]
["9-9","Arrowhead","Hunting Lodge","Sawmill","Cimarroncita","Upper Dean Cow","Black Horse Mine","Touch-Me-Not Creek",null,null,null,null,"Azurite","T",null,null,null,"Y","Y"]
["9-10","Line","Fish Camp","Apache Springs","Porcupine","Miners Park","Urraca","Stockade Ridge",null,null,null,null,"Backache Springs","T","","","","Y",""]
["9-11","Abreu","Crater Lake","Beaubien","Comanche Creek","Red Hills","Black Mountain","Shaefers Pass",null,null,null,null,"Baldy Skyline","T","","","","Y",""]
["9-12","Line","Crags","Apache Springs","Beaubien","Crooked Creek","Mount Phillips","American Creek",null,null,null,null,"Baldy Town","S","Y","Y","Y","",""]
["9-13","Harlan","Devil's Wash Basin","Sawmill","Mount Phillips","Porcupine","Beaubien","Shaefers Pass",null,null,null,null,"Base","S","","","","Y",""]
["9-14","Flume Canyon","Pueblano","Ewells Park","Ewells Park","Head of Dean","Minnette Meadows","Harlan",null,null,null,null,"Bear Canyon","T","","","","Y",""]
["9-15","Bluestem","Pueblano","Copper Park","Head of Dean","Cimarroncita","Whistle Punk","Clarks Fork",null,null,null,null,"Bear Caves","T","","","","Y",""]
["Food Pickups",null,null,null,null,null,null,null,null,null,null,null,"Bear Creek","T","","","","Y",""]
[{"$f":"A1","v":"Itinerary"},{"$f":"B1","v":"Day 2"},{"$f":"C1","v":"Day 3"},{"$f":"D1","v":"Day 4"},{"$f":"E1","v":"Day 5"},{"$f":"F1","v":"Day 6"},{"$f":"G1","v":"Day 7"},{"$f":"H1","v":"Day 8"},{"$f":"I1","v":"Day 9"},{"$f":"J1","v":"Day 10"},{"$f":"K1","v":"Day 11"},null,"Beatty Lakes","T","","","","Y","Y"]
[{"$f":"A2","v":"9-1"},"Camping HQ",null,"Cimarroncita",null,null,"Ponil",null,null,null,null,null,"Beaubien","S","Y","","","",""]
[{"$f":"A3","v":"9-2"},"Camping HQ",null,null,"Ponil",null,"Baldy Town",null,null,null,null,null,"Bent","T","","","","Y",""]
[{"$f":"A4","v":"9-3"},"Camping HQ",null,"Miners Park",null,null,"Phillips Junction",null,null,null,null,null,"Black Horse","T","","","","Y",""]
["9-4","Camping HQ",null,"Cimarroncito",null,"Sawmill",null,null,null,null,null,null,"Black Horse Creek","T","","","","Y",""]
["9-5","Camping HQ",null,null,"Baldy Town",null,"Rich Cabins",null,null,null,null,null,"Black Horse Mine","T",null,null,null,"Y","Y"]
[{"$f":"A4","v":"9-3"},"Camping HQ",null,"Baldy Town",null,null,null,"Cimarroncita",null,null,null,null,"Black Jacks","T","","","","Y",""]
[{"$f":"A5","v":"9-4"},"Camping HQ",null,"Ponil",null,null,"Baldy Town",null,null,null,null,null,"Black Mountain","S","","","","",""]
[{"$f":"A6","v":"9-5"},"Camping HQ",null,"Miners Park",null,"Cimarroncito",null,null,null,null,null,null,"Bluestem","T",null,null,null,"Y","Y"]
[{"$f":"A7","v":"9-6"},"Camping HQ",null,"Sawmill",null,null,"Baldy Town",null,null,null,null,null,"Bonita Cow","T","","","","Y",""]
[{"$f":"A11","v":"9-10"},"Camping HQ",null,"Apache Springs",null,"Miners Park",null,null,null,null,null,null,"Buck Creek","T","","","","Y",""]
["9-11","Camping HQ",null,null,"Phillips Junction",null,null,null,null,null,null,null,"Camping HQ","T","","","","Y",""]
["9-12","Camping HQ",null,"Apache Springs",null,"Phillips Junction",null,null,null,null,null,null,"Campos Heck","T","","","","Y",""]
["9-13","Camping HQ",null,"Sawmill",null,null,"Phillips Junction",null,null,null,null,null,"Carson Meadows","S","","","","",""]
["9-14","Camping HQ",null,null,"Baldy Town",null,"Cimarroncita",null,null,null,null,null,"Cathedral Rock","T","","","","Y",""]
[{"$f":"A16","v":"9-15"},"Camping HQ",null,null,null,"Cimarroncita",null,null,null,null,null,null,"Chase Canyon","T","","","","Y",""]
[null,null,null,null,null,null,null,null,null,null,null,null,"Chase Cow","S",null,null,null,"",""]
[null,null,null,null,null,null,null,null,null,null,null,null,"Chase Ranch","S","","","","","Y"]
[null,null,null,null,null,null,null,null,null,null,null,null,"Cimarron River","T","","","","Y",""]
[null,null,null,null,null,null,null,null,null,null,null,null,"Cimarroncita","S",null,null,null,"",""]
[null,null,null,null,null,null,null,null,null,null,null,null,"Cimarroncito","S","Y","","","",""]
[null,null,null,null,null,null,null,null,null,null,null,null,"Clarks Fork","S","Y","","","",""]
[null,null,null,null,null,null,null,null,null,null,null,null,"Clear Creek","S","","","","",""]
[null,null,null,null,null,null,null,null,null,null,null,null,"Comanche Creek","T","","","","Y",""]
[null,null,null,null,null,null,null,null,null,null,null,null,"Comanche Peak","T","","","","Y","Y"]
[null,null,null,null,null,null,null,null,null,null,null,null,"Cook Canyon","T","","","","Y",""]
[null,null,null,null,null,null,null,null,null,null,null,null,"Copper Park","T","","","","Y",""]
[null,null,null,null,null,null,null,null,null,null,null,null,"Cottonwood","T","","","","Y",""]
[null,null,null,null,null,null,null,null,null,null,null,null,"Coyote Howl","T",null,null,null,"Y"]
[null,null,null,null,null,null,null,null,null,null,null,null,"Crags","T","","","","Y",""]
[null,null,null,null,null,null,null,null,null,null,null,null,"Crater Lake","S","","","","",""]
[null,null,null,null,null,null,null,null,null,null,null,null,"Crooked Creek","S","","","","",""]
[null,null,null,null,null,null,null,null,null,null,null,null,"Cyphers Mine","S","Y","","","",""]
[null,null,null,null,null,null,null,null,null,null,null,null,"Dan Beard","S","","","","",""]
[null,null,null,null,null,null,null,null,null,null,null,null,"Daves Lake","T",null,null,null,"Y",""]
[null,null,null,null,null,null,null,null,null,null,null,null,"Dean Cow","S","Y","","","",""]
[null,null,null,null,null,null,null,null,null,null,null,null,"Dean Cutoff","T","","","","Y",""]
[null,null,null,null,null,null,null,null,null,null,null,null,"Dean Heck","T","","","","Y",""]
[null,null,null,null,null,null,null,null,null,null,null,null,"Dean Skyline","T",null,null,null,"Y","Y"]
[null,null,null,null,null,null,null,null,null,null,null,null,"Deer Lake","T","","","","Y",""]
[null,null,null,null,null,null,null,null,null,null,null,null,"Deer Lake Mesa","T","","","","Y",""]
[null,null,null,null,null,null,null,null,null,null,null,null,"Demonstration Forest","T","","","","Y","Y"]
[null,null,null,null,null,null,null,null,null,null,null,null,"Devil's Wash Basin","T","","","","Y","Y"]
[null,null,null,null,null,null,null,null,null,null,null,null,"Divide","T",null,null,null,"Y","Y"]
[null,null,null,null,null,null,null,null,null,null,null,null,"Elkhorn","T","","","","Y",""]
[null,null,null,null,null,null,null,null,null,null,null,null,"Ewells Park","T","","","","Y",""]
[null,null,null,null,null,null,null,null,null,null,null,null,"Fish Camp","S","","","","",""]
[null,null,null,null,null,null,null,null,null,null,null,null,"Flume Canyon","T","","","","Y",""]
[null,null,null,null,null,null,null,null,null,null,null,null,"French Henry","S","","","","",""]
[null,null,null,null,null,null,null,null,null,null,null,null,"Garcia Cow","S",null,null,null,"",""]
[null,null,null,null,null,null,null,null,null,null,null,null,"Greenwood Canyon","T","","","","Y",""]
[null,null,null,null,null,null,null,null,null,null,null,null,"Harlan","S","","","","",""]
[null,null,null,null,null,null,null,null,null,null,null,null,"Hawkeye","T","","","","Y","Y"]
[null,null,null,null,null,null,null,null,null,null,null,null,"Head of Dean","S","","","","",""]
[null,null,null,null,null,null,null,null,null,null,null,null,"Heck Meadow","T",null,null,null,"Y","Y"]
[null,null,null,null,null,null,null,null,null,null,null,null,"Hells Fire Canyon","T","","","","Y",""]
[null,null,null,null,null,null,null,null,null,null,null,null,"Herradura","T","","","","Y","Y"]
[null,null,null,null,null,null,null,null,null,null,null,null,"Horse Canyon","T","","","","Y",""]
[null,null,null,null,null,null,null,null,null,null,null,null,"House Canyon","T","","","","Y",""]
[null,null,null,null,null,null,null,null,null,null,null,null,"Hunting Lodge","T","","","","",""]
[null,null,null,null,null,null,null,null,null,null,null,null,"Indian Writings","S","Y","","","",""]
[null,null,null,null,null,null,null,null,null,null,null,null,"Iris Park","T","","","","Y",""]
[null,null,null,null,null,null,null,null,null,null,null,null,"Kit Carson","S","","","","",""]
[null,null,null,null,null,null,null,null,null,null,null,null,"Lamberts Mine","T","","","","Y",""]
[null,null,null,null,null,null,null,null,null,null,null,null,"Line","T","","","","Y",""]
[null,null,null,null,null,null,null,null,null,null,null,null,"Line Camp","T","","","","Y",""]
[null,null,null,null,null,null,null,null,null,null,null,null,"Little Costilla","T","","","","Y",""]
[null,null,null,null,null,null,null,null,null,null,null,null,"Little Twin","T",null,null,null,"Y","Y"]
[null,null,null,null,null,null,null,null,null,null,null,null,"Lookout Meadow","T","","","","Y",""]
[null,null,null,null,null,null,null,null,null,null,null,null,"Lost Cabins","T","","","","Y",""]
[null,null,null,null,null,null,null,null,null,null,null,null,"Lost Gap","T","","","","Y","Y"]
[null,null,null,null,null,null,null,null,null,null,null,null,"Lovato","T",null,null,null,"Y",""]
[null,null,null,null,null,null,null,null,null,null,null,null,"Lovers Leap","T","","","","Y",""]
[null,null,null,null,null,null,null,null,null,null,null,null,"Lower Bonito","T","","","","Y",""]
[null,null,null,null,null,null,null,null,null,null,null,null,"Lower Sawmill","T","","","","Y",""]
[null,null,null,null,null,null,null,null,null,null,null,null,"Magpie","T",null,null,null,"Y","Y"]
[null,null,null,null,null,null,null,null,null,null,null,null,"Martinez Springs","T","","","","Y",""]
[null,null,null,null,null,null,null,null,null,null,null,null,"Maxwell","T","","","","Y",""]
[null,null,null,null,null,null,null,null,null,null,null,null,"McBride Canyon","T","","","","Y","Y"]
[null,null,null,null,null,null,null,null,null,null,null,null,"McCrystal Creek","T","","","","Y",""]
[null,null,null,null,null,null,null,null,null,null,null,null,"Metcalf Station","S","","","","",""]
[null,null,null,null,null,null,null,null,null,null,null,null,"Middle Ponil","T","","","","Y",""]
[null,null,null,null,null,null,null,null,null,null,null,null,"Miners Park","S","Y","Y","","",""]
[null,null,null,null,null,null,null,null,null,null,null,null,"Minnette Meadows","T","","","","Y","Y"]
[null,null,null,null,null,null,null,null,null,null,null,null,"Miranda","S","","","","",""]
[null,null,null,null,null,null,null,null,null,null,null,null,"Mistletoe","T",null,null,null,"Y","Y"]
[null,null,null,null,null,null,null,null,null,null,null,null,"Mount Phillips","T","","","","Y","Y"]
[null,null,null,null,null,null,null,null,null,null,null,null,"Mt Phillips","T","","","","Y","Y"]
[null,null,null,null,null,null,null,null,null,null,null,null,"New Dean","T","","","","Y",""]
[null,null,null,null,null,null,null,null,null,null,null,null,"North Fork Urraca","T","","","","Y",""]
[null,null,null,null,null,null,null,null,null,null,null,null,"North Ponil","T",null,null,null,"Y",""]
[null,null,null,null,null,null,null,null,null,null,null,null,"Old Abreu","T","","","","Y",""]
[null,null,null,null,null,null,null,null,null,null,null,null,"Old Camp","T","","","","Y",""]
[null,null,null,null,null,null,null,null,null,null,null,null,"Olympia","T","","","","Y",""]
[null,null,null,null,null,null,null,null,null,null,null,null,"Phillips Junction","S","Y","Y","Y","",""]
[null,null,null,null,null,null,null,null,null,null,null,null,"Pinyon Flats","T","","","","Y",""]
[null,null,null,null,null,null,null,null,null,null,null,null,"Placer","T",null,null,null,"Y"]
[null,null,null,null,null,null,null,null,null,null,null,null,"Ponderosa Park","T","","","","Y","Y"]
[null,null,null,null,null,null,null,null,null,null,null,null,"Ponil","S","Y","Y","Y","",""]
[null,null,null,null,null,null,null,null,null,null,null,null,"Porcupine","T","","","","Y",""]
[null,null,null,null,null,null,null,null,null,null,null,null,"Pueblano","S","","","","",""]
[null,null,null,null,null,null,null,null,null,null,null,null,"Pueblano Ruins","T","","","","Y",""]
[null,null,null,null,null,null,null,null,null,null,null,null,"Rabbit Ear","T",null,null,null,"Y","Y"]
[null,null,null,null,null,null,null,null,null,null,null,null,"Rayado","T","","","","Y",""]
[null,null,null,null,null,null,null,null,null,null,null,null,"Rayado Ridge","T","Y","","","Y",""]
[null,null,null,null,null,null,null,null,null,null,null,null,"Rayado River","T","","","","Y",""]
[null,null,null,null,null,null,null,null,null,null,null,null,"Red Hills","T","","","","Y",""]
[null,null,null,null,null,null,null,null,null,null,null,null,"Rich Cabins","S","","Y","","",""]
[null,null,null,null,null,null,null,null,null,null,null,null,"Rimrock Park","T","","","","Y","Y"]
[null,null,null,null,null,null,null,null,null,null,null,null,"Ring Place","S","","Y","","",""]
[null,null,null,null,null,null,null,null,null,null,null,null,"Ringtail","T",null,null,null,"Y","Y"]
[null,null,null,null,null,null,null,null,null,null,null,null,"RMSC","T","","","","Y",""]
[null,null,null,null,null,null,null,null,null,null,null,null,"Rock Springs","T","","","","Y",""]
[null,null,null,null,null,null,null,null,null,null,null,null,"Saladon","T",null,null,null,"Y",""]
[null,null,null,null,null,null,null,null,null,null,null,null,"Santa Claus","S","","","","",""]
[null,null,null,null,null,null,null,null,null,null,null,null,"Sawmill","S","Y","","","",""]
[null,null,null,null,null,null,null,null,null,null,null,null,"Seally Canyon","T","","","","Y","Y"]
[null,null,null,null,null,null,null,null,null,null,null,null,"Shaefers Pass","T","","","","Y","Y"]
[null,null,null,null,null,null,null,null,null,null,null,null,"Shuree Cabin","T","","","","Y",""]
[null,null,null,null,null,null,null,null,null,null,null,null,"Shuree Lodge","T","","","","Y",""]
[null,null,null,null,null,null,null,null,null,null,null,null,"Sioux","T","","","","Y",""]
[null,null,null,null,null,null,null,null,null,null,null,null,"Six Mile Gate","T","","","","Y",""]
[null,null,null,null,null,null,null,null,null,null,null,null,"Slate Hill Heck","T","","","","Y","Y"]
[null,null,null,null,null,null,null,null,null,null,null,null,"Stockade","T","","","","Y",""]
[null,null,null,null,null,null,null,null,null,null,null,null,"Stockade Ridge","T","","","","Y","Y"]
[null,null,null,null,null,null,null,null,null,null,null,null,"Thunder Ridge","T","","","","Y","Y"]
[null,null,null,null,null,null,null,null,null,null,null,null,"Tolby Headwaters","T",null,null,null,"Y",""]
[null,null,null,null,null,null,null,null,null,null,null,null,"Tooth Ridge","T","","","","Y","Y"]
[null,null,null,null,null,null,null,null,null,null,null,null,"Toothache Springs","T","","","","Y",""]
[null,null,null,null,null,null,null,null,null,null,null,null,"Touch-Me-Not Creek","T",null,null,null,"Y",""]
[null,null,null,null,null,null,null,null,null,null,null,null,"Trail Canyon","T","","","","Y",""]
[null,null,null,null,null,null,null,null,null,null,null,null,"Turkey Creek","T","","","","Y",""]
[null,null,null,null,null,null,null,null,null,null,null,null,"Upper Bench","T","","","","Y","Y"]
[null,null,null,null,null,null,null,null,null,null,null,null,"Upper Clarks Fork","T","","","","Y","Y"]
[null,null,null,null,null,null,null,null,null,null,null,null,"Upper Dean Cow","T","","","","Y",""]
[null,null,null,null,null,null,null,null,null,null,null,null,"Upper Greenwood","T","","","","Y",""]
[null,null,null,null,null,null,null,null,null,null,null,null,"Upper Sawmill","T","","","","Y",""]
[null,null,null,null,null,null,null,null,null,null,null,null,"Upper Webster Park","T",null,null,null,"Y",""]
[null,null,null,null,null,null,null,null,null,null,null,null,"Urraca","S","","","","",""]
[null,null,null,null,null,null,null,null,null,null,null,null,"Ute Gulch","S","","Y","Y","",""]
[null,null,null,null,null,null,null,null,null,null,null,null,"Ute Meadows","T","","","","Y",""]
[null,null,null,null,null,null,null,null,null,null,null,null,"Ute Park Pass","T","","","","Y",""]
[null,null,null,null,null,null,null,null,null,null,null,null,"Ute Springs","T","","","","Y",""]
[null,null,null,null,null,null,null,null,null,null,null,null,"Vaca","T","","","","Y",""]
[null,null,null,null,null,null,null,null,null,null,null,null,"Visto Grande","T","","","","Y",""]
[null,null,null,null,null,null,null,null,null,null,null,null,"Webster Lake","T","","","","Y",""]
[null,null,null,null,null,null,null,null,null,null,null,null,"Webster Parks","T","","","","Y","Y"]
[null,null,null,null,null,null,null,null,null,null,null,null,"Whistle Punk","T","","","","Y",""]
[null,null,null,null,null,null,null,null,null,null,null,null,"Whiteman Vega","S","","","","",""]
[null,null,null,null,null,null,null,null,null,null,null,null,"Wild Horse","T","","","","Y",""]
[null,null,null,null,null,null,null,null,null,null,null,null,"Wild Horse Park","T",null,null,null,"Y",""]
[null,null,null,null,null,null,null,null,null,null,null,null,"Window Rock","T","","","","Y","Y"]
[null,null,null,null,null,null,null,null,null,null,null,null,"Zastrow","S","Y","Y","","",""]